BDBM28675 2-[(3-{[5-(carboxymethoxy)-1,2,3,4-tetrahydroisoquinoline-2-]sulfonyl}benzene)amido]-5-chlorobenzoic acid::Anthranilic acid deriv., 14
SMILES: OC(=O)COc1cccc2CN(CCc12)S(=O)(=O)c1cccc(c1)C(=O)Nc1ccc(Cl)cc1C(O)=O
InChI Key: InChIKey=NIPHPZHHUCNETC-UHFFFAOYSA-N
Data: 6 IC50  1 EC50
Activity Spreadsheet -- Enzyme Inhibition Constant Data from BindingDB
Found 6 hits for monomerid = 28675
Trg + Lig
Ki
nM
ΔG°
kcal/mole
IC50
nM
Kd
nM
EC50/IC50
nM
koff
s-1
kon
M-1s-1
pHTemp
°C
Peroxisome proliferator-activated receptor delta
(Homo sapiens (Human))
BDBM28675
(2-[(3-{[5-(carboxymethoxy)-1,2,3,4-tetrahydroisoqu...)
Show SMILES OC(=O)COc1cccc2CN(CCc12)S(=O)(=O)c1cccc(c1)C(=O)Nc1ccc(Cl)cc1C(O)=O
Show InChI InChI=1S/C25H21ClN2O8S/c26-17-7-8-21(20(12-17)25(32)33)27-24(31)15-3-1-5-18(11-15)37(34,35)28-10-9-19-16(13-28)4-2-6-22(19)36-14-23(29)30/h1-8,11-12H,9-10,13-14H2,(H,27,31)(H,29,30)(H,32,33)
n/an/a 10n/a>1.00E+4n/an/a7.022
GSK
Assay Description
Competition-binding curves for test compounds were determined with expressed human PPAR LBD. Plots of inhibitor concentration versus cpm of radioliga...
Bioorg Med Chem Lett 18: 5018-22 (2008)
Article DOI: 10.1016/j.bmcl.2008.08.011
BindingDB Entry DOI: 10.7270/Q2WD3XWS
Peroxisome proliferator-activated receptor alpha (PPAR alpha)
(Homo sapiens (Human))
BDBM28675
(2-[(3-{[5-(carboxymethoxy)-1,2,3,4-tetrahydroisoqu...)
Show SMILES OC(=O)COc1cccc2CN(CCc12)S(=O)(=O)c1cccc(c1)C(=O)Nc1ccc(Cl)cc1C(O)=O
Show InChI InChI=1S/C25H21ClN2O8S/c26-17-7-8-21(20(12-17)25(32)33)27-24(31)15-3-1-5-18(11-15)37(34,35)28-10-9-19-16(13-28)4-2-6-22(19)36-14-23(29)30/h1-8,11-12H,9-10,13-14H2,(H,27,31)(H,29,30)(H,32,33)
n/an/a 5.01E+3n/an/an/an/an/an/a
GSK
Assay Description
Competition-binding curves for test compounds were determined with expressed human PPAR LBD. Plots of inhibitor concentration versus cpm of radioliga...
Bioorg Med Chem Lett 18: 5018-22 (2008)
Article DOI: 10.1016/j.bmcl.2008.08.011
BindingDB Entry DOI: 10.7270/Q2WD3XWS
Peroxisome proliferator-activated receptor alpha (PPAR alpha)
(Homo sapiens (Human))
BDBM28675
(2-[(3-{[5-(carboxymethoxy)-1,2,3,4-tetrahydroisoqu...)
Show SMILES OC(=O)COc1cccc2CN(CCc12)S(=O)(=O)c1cccc(c1)C(=O)Nc1ccc(Cl)cc1C(O)=O
Show InChI InChI=1S/C25H21ClN2O8S/c26-17-7-8-21(20(12-17)25(32)33)27-24(31)15-3-1-5-18(11-15)37(34,35)28-10-9-19-16(13-28)4-2-6-22(19)36-14-23(29)30/h1-8,11-12H,9-10,13-14H2,(H,27,31)(H,29,30)(H,32,33)
n/an/a 5.01E+3n/an/an/an/an/an/a
Universidad Nacional Aut£noma de M£xico
Curated by ChEMBL
Assay Description
Agonist activity at PPARalpha
Bioorg Med Chem 20: 3523-32 (2012)
Article DOI: 10.1016/j.bmc.2012.04.005
BindingDB Entry DOI: 10.7270/Q2MP54B4
Peroxisome proliferator-activated receptor delta
(Homo sapiens (Human))
BDBM28675
(2-[(3-{[5-(carboxymethoxy)-1,2,3,4-tetrahydroisoqu...)
Show SMILES OC(=O)COc1cccc2CN(CCc12)S(=O)(=O)c1cccc(c1)C(=O)Nc1ccc(Cl)cc1C(O)=O
Show InChI InChI=1S/C25H21ClN2O8S/c26-17-7-8-21(20(12-17)25(32)33)27-24(31)15-3-1-5-18(11-15)37(34,35)28-10-9-19-16(13-28)4-2-6-22(19)36-14-23(29)30/h1-8,11-12H,9-10,13-14H2,(H,27,31)(H,29,30)(H,32,33)
n/an/a 10n/an/an/an/an/an/a
Universidad Nacional Aut£noma de M£xico
Curated by ChEMBL
Assay Description
Agonist activity at PPARdelta
Bioorg Med Chem 20: 3523-32 (2012)
Article DOI: 10.1016/j.bmc.2012.04.005
BindingDB Entry DOI: 10.7270/Q2MP54B4
Peroxisome proliferator-activated receptor
(Homo sapiens (Human))
BDBM28675
(2-[(3-{[5-(carboxymethoxy)-1,2,3,4-tetrahydroisoqu...)
Show SMILES OC(=O)COc1cccc2CN(CCc12)S(=O)(=O)c1cccc(c1)C(=O)Nc1ccc(Cl)cc1C(O)=O
Show InChI InChI=1S/C25H21ClN2O8S/c26-17-7-8-21(20(12-17)25(32)33)27-24(31)15-3-1-5-18(11-15)37(34,35)28-10-9-19-16(13-28)4-2-6-22(19)36-14-23(29)30/h1-8,11-12H,9-10,13-14H2,(H,27,31)(H,29,30)(H,32,33)
NCI pathway
Reactome pathway
n/an/a 7.94E+3n/an/an/an/an/an/a
Universidad Nacional Aut£noma de M£xico
Curated by ChEMBL
Assay Description
Agonist activity at PPARgamma
Bioorg Med Chem 20: 3523-32 (2012)
Article DOI: 10.1016/j.bmc.2012.04.005
BindingDB Entry DOI: 10.7270/Q2MP54B4
Peroxisome proliferator-activated receptor
(Homo sapiens (Human))
BDBM28675
(2-[(3-{[5-(carboxymethoxy)-1,2,3,4-tetrahydroisoqu...)
Show SMILES OC(=O)COc1cccc2CN(CCc12)S(=O)(=O)c1cccc(c1)C(=O)Nc1ccc(Cl)cc1C(O)=O
Show InChI InChI=1S/C25H21ClN2O8S/c26-17-7-8-21(20(12-17)25(32)33)27-24(31)15-3-1-5-18(11-15)37(34,35)28-10-9-19-16(13-28)4-2-6-22(19)36-14-23(29)30/h1-8,11-12H,9-10,13-14H2,(H,27,31)(H,29,30)(H,32,33)
NCI pathway
Reactome pathway
n/an/a 7.94E+3n/an/an/an/an/an/a
GSK
Assay Description
Competition-binding curves for test compounds were determined with expressed human PPAR LBD. Plots of inhibitor concentration versus cpm of radioliga...
Bioorg Med Chem Lett 18: 5018-22 (2008)
Article DOI: 10.1016/j.bmcl.2008.08.011
BindingDB Entry DOI: 10.7270/Q2WD3XWS