BDBM29272 quinolinone, 42
SMILES: Cn1cncc1C(=O)N(Cc1cc(=O)[nH]c2c(F)c(F)ccc12)c1cccc(Cl)c1
InChI Key: InChIKey=VDKGHNONPLKNFN-UHFFFAOYSA-N
Data: 3 EC50
Activity Spreadsheet -- Enzyme Inhibition Constant Data from BindingDB
Found 3 hits for monomerid = 29272
Trg + Lig
Ki
nM
ΔG°
kcal/mole
IC50
nM
Kd
nM
EC50/IC50
nM
koff
s-1
kon
M-1s-1
pHTemp
°C
Nitric oxide synthase, inducible
(Homo sapiens (Human))
BDBM29272
(quinolinone, 42)
Show SMILES Cn1cncc1C(=O)N(Cc1cc(=O)[nH]c2c(F)c(F)ccc12)c1cccc(Cl)c1
Show InChI InChI=1S/C21H15ClF2N4O2/c1-27-11-25-9-17(27)21(30)28(14-4-2-3-13(22)8-14)10-12-7-18(29)26-20-15(12)5-6-16(23)19(20)24/h2-9,11H,10H2,1H3,(H,26,29)
NCI pathway
Reactome pathway
n/an/an/an/a 3n/an/an/a25
Kalypsys Inc.
Assay Description
HEK293 cells (ATCC) were transiently transfected with recombinant NOS and grown. Cells were trypsinized, resuspended to 5 00,000 cells/mL, and plated...
J Med Chem 52: 3047-62 (2009)
Article DOI: 10.1021/jm900173b
BindingDB Entry DOI: 10.7270/Q2D798RB
Nitric oxide synthase, brain
(Homo sapiens (Human))
BDBM29272
(quinolinone, 42)
Show SMILES Cn1cncc1C(=O)N(Cc1cc(=O)[nH]c2c(F)c(F)ccc12)c1cccc(Cl)c1
Show InChI InChI=1S/C21H15ClF2N4O2/c1-27-11-25-9-17(27)21(30)28(14-4-2-3-13(22)8-14)10-12-7-18(29)26-20-15(12)5-6-16(23)19(20)24/h2-9,11H,10H2,1H3,(H,26,29)
Reactome pathway
n/an/an/an/a 70n/an/an/a25
Kalypsys Inc.
Assay Description
HEK293 cells (ATCC) were transiently transfected with recombinant NOS and grown. Cells were trypsinized, resuspended to 5 00,000 cells/mL, and plated...
J Med Chem 52: 3047-62 (2009)
Article DOI: 10.1021/jm900173b
BindingDB Entry DOI: 10.7270/Q2D798RB
Nitric oxide synthase, endothelial
(Homo sapiens (Human))
BDBM29272
(quinolinone, 42)
Show SMILES Cn1cncc1C(=O)N(Cc1cc(=O)[nH]c2c(F)c(F)ccc12)c1cccc(Cl)c1
Show InChI InChI=1S/C21H15ClF2N4O2/c1-27-11-25-9-17(27)21(30)28(14-4-2-3-13(22)8-14)10-12-7-18(29)26-20-15(12)5-6-16(23)19(20)24/h2-9,11H,10H2,1H3,(H,26,29)
n/an/an/an/a 420n/an/an/a25
Kalypsys Inc.
Assay Description
HEK293 cells (ATCC) were transiently transfected with recombinant NOS and grown. Cells were trypsinized, resuspended to 5 00,000 cells/mL, and plated...
J Med Chem 52: 3047-62 (2009)
Article DOI: 10.1021/jm900173b
BindingDB Entry DOI: 10.7270/Q2D798RB