BDBM294112 US10336741, Example 99::US10882855, Example 99::US9585881, Example 99::methyl [4-(2-{(2S,4S)-1-[(1-carbamimidoyl-4-piperidinyl)carbonyl]-4-[4-(methylsulfonyl)-1-piperazinyl]-2-pyrrolidinyl}-4-chloro-1H-imidazol-5-yl)phenyl]carbamate trihydrochloride
SMILES: COC(=O)Nc1ccc(cc1)-c1[nH]c(nc1Cl)[C@@H]1C[C@@H](CN1C(=O)C1CCN(CC1)C(N)=N)N1CCN(CC1)S(C)(=O)=O
InChI Key:
Data: 9 IC50
Activity Spreadsheet -- Enzyme Inhibition Constant Data from BindingDB
Found 9 hits for monomerid = 294112
Trg + Lig
Ki
nM
ΔG°
kcal/mole
IC50
nM
Kd
nM
EC50/IC50
nM
koff
s-1
kon
M-1s-1
pHTemp
°C
Coagulation factor XI
(Homo sapiens (Human))
BDBM294112
(US10336741, Example 99 | US10882855, Example 99 | ...)
Show SMILES COC(=O)Nc1ccc(cc1)-c1[nH]c(nc1Cl)[C@@H]1C[C@@H](CN1C(=O)C1CCN(CC1)C(N)=N)N1CCN(CC1)S(C)(=O)=O |r|
Reactome pathway
US Patent
n/an/a 1.20n/an/an/an/an/an/a
ONO PHARMACEUTICAL CO., LTD.
US Patent
Assay Description
Human Factor XIa (Haematologic Technologies Inc.) activity was measured at an enzyme concentration of 0.1 U/mL in 150 mM NaCl, 5 mM KCl, 1 mg/mL PEG6...
US Patent US9585881 (2017)
BindingDB Entry DOI: 10.7270/Q2D50Q0R
Prothrombin
(Homo sapiens (Human))
BDBM294112
(US10336741, Example 99 | US10882855, Example 99 | ...)
Show SMILES COC(=O)Nc1ccc(cc1)-c1[nH]c(nc1Cl)[C@@H]1C[C@@H](CN1C(=O)C1CCN(CC1)C(N)=N)N1CCN(CC1)S(C)(=O)=O |r|
US Patent
n/an/a 8.40E+4n/an/an/an/an/an/a
ONO PHARMACEUTICAL CO., LTD.
US Patent
Assay Description
Human Factor Xa (American Diagnostica Inc.) and human thrombin (Sigma) activities were measured at the enzyme concentrations of 0.18 U/mL and 0.12 U/...
US Patent US9585881 (2017)
BindingDB Entry DOI: 10.7270/Q2D50Q0R
Coagulation factor X
(Homo sapiens (Human))
BDBM294112
(US10336741, Example 99 | US10882855, Example 99 | ...)
Show SMILES COC(=O)Nc1ccc(cc1)-c1[nH]c(nc1Cl)[C@@H]1C[C@@H](CN1C(=O)C1CCN(CC1)C(N)=N)N1CCN(CC1)S(C)(=O)=O |r|
Reactome pathway
US Patent
n/an/a>1.00E+5n/an/an/an/an/an/a
ONO PHARMACEUTICAL CO., LTD.
US Patent
Assay Description
Human Factor Xa (American Diagnostica Inc.) and human thrombin (Sigma) activities were measured at the enzyme concentrations of 0.18 U/mL and 0.12 U/...
US Patent US9585881 (2017)
BindingDB Entry DOI: 10.7270/Q2D50Q0R
Coagulation factor XI
(Homo sapiens (Human))
BDBM294112
(US10336741, Example 99 | US10882855, Example 99 | ...)
Show SMILES COC(=O)Nc1ccc(cc1)-c1[nH]c(nc1Cl)[C@@H]1C[C@@H](CN1C(=O)C1CCN(CC1)C(N)=N)N1CCN(CC1)S(C)(=O)=O |r|
Reactome pathway
US Patent
n/an/a 1.20n/an/an/an/an/an/a
Ono Pharmaceutical Co., Ltd
US Patent
Assay Description
Inhibitory activities of compounds of the present invention against factor XIa, Xa, XIIa, IXa, VIIa, plasma kallikrein or thrombin were evaluated usi...
US Patent US10336741 (2019)
BindingDB Entry DOI: 10.7270/Q2CR5WQP
Coagulation factor X
(Homo sapiens (Human))
BDBM294112
(US10336741, Example 99 | US10882855, Example 99 | ...)
Show SMILES COC(=O)Nc1ccc(cc1)-c1[nH]c(nc1Cl)[C@@H]1C[C@@H](CN1C(=O)C1CCN(CC1)C(N)=N)N1CCN(CC1)S(C)(=O)=O |r|
Reactome pathway
US Patent
n/an/a>1.00E+5n/an/an/an/an/an/a
ONO PHARMACEUTICAL CO., LTD.
US Patent
Assay Description
Human Factor Xa (American Diagnostica Inc.) and human thrombin (Sigma) activities were measured at the enzyme concentrations of 0.18 U/mL and 0.12 U/...
US Patent US10882855 (2021)
Coagulation factor X
(Homo sapiens (Human))
BDBM294112
(US10336741, Example 99 | US10882855, Example 99 | ...)
Show SMILES COC(=O)Nc1ccc(cc1)-c1[nH]c(nc1Cl)[C@@H]1C[C@@H](CN1C(=O)C1CCN(CC1)C(N)=N)N1CCN(CC1)S(C)(=O)=O |r|
Reactome pathway
US Patent
n/an/a>1.00E+5n/an/an/an/an/an/a
Ono Pharmaceutical Co., Ltd
US Patent
Assay Description
Inhibitory activities of compounds of the present invention against factor XIa, Xa, XIIa, IXa, VIIa, plasma kallikrein or thrombin were evaluated usi...
US Patent US10336741 (2019)
BindingDB Entry DOI: 10.7270/Q2CR5WQP
Coagulation factor XI
(Homo sapiens (Human))
BDBM294112
(US10336741, Example 99 | US10882855, Example 99 | ...)
Show SMILES COC(=O)Nc1ccc(cc1)-c1[nH]c(nc1Cl)[C@@H]1C[C@@H](CN1C(=O)C1CCN(CC1)C(N)=N)N1CCN(CC1)S(C)(=O)=O |r|
Reactome pathway
US Patent
n/an/a 1.20n/an/an/an/an/an/a
ONO PHARMACEUTICAL CO., LTD.
US Patent
Assay Description
Human Factor XIa (Haematologic Technologies Inc.) activity was measured at an enzyme concentration of 0.1 U/mL in 150 mM NaCl, 5 mM KCl, 1 mg/mL PEG6...
US Patent US10882855 (2021)
Prothrombin
(Homo sapiens (Human))
BDBM294112
(US10336741, Example 99 | US10882855, Example 99 | ...)
Show SMILES COC(=O)Nc1ccc(cc1)-c1[nH]c(nc1Cl)[C@@H]1C[C@@H](CN1C(=O)C1CCN(CC1)C(N)=N)N1CCN(CC1)S(C)(=O)=O |r|
US Patent
n/an/a 8.40E+4n/an/an/an/an/an/a
ONO PHARMACEUTICAL CO., LTD.
US Patent
Assay Description
Human Factor Xa (American Diagnostica Inc.) and human thrombin (Sigma) activities were measured at the enzyme concentrations of 0.18 U/mL and 0.12 U/...
US Patent US10882855 (2021)
Prothrombin
(Homo sapiens (Human))
BDBM294112
(US10336741, Example 99 | US10882855, Example 99 | ...)
Show SMILES COC(=O)Nc1ccc(cc1)-c1[nH]c(nc1Cl)[C@@H]1C[C@@H](CN1C(=O)C1CCN(CC1)C(N)=N)N1CCN(CC1)S(C)(=O)=O |r|
US Patent
n/an/a 8.40E+4n/an/an/an/an/an/a
Ono Pharmaceutical Co., Ltd
US Patent
Assay Description
Inhibitory activities of compounds of the present invention against factor XIa, Xa, XIIa, IXa, VIIa, plasma kallikrein or thrombin were evaluated usi...
US Patent US10336741 (2019)
BindingDB Entry DOI: 10.7270/Q2CR5WQP