BDBM298073 3-[5-(2-phenylethyl)-1,3,4-oxadiazol-2-yl]-7-(piperidin-4-yl)pyrazolo[1,5-a]pyrimidin-5(4H)-one hydrochloride::US10118930, Example 283
SMILES: O=c1cc(C2CCNCC2)n2ncc(-c3nnc(CCc4ccccc4)o3)c2[nH]1
InChI Key: InChIKey=ITPYUSSKAZWCFH-UHFFFAOYSA-N
Data: 1 IC50
Activity Spreadsheet -- Enzyme Inhibition Constant Data from BindingDB
Found 1 hit for monomerid = 298073
Trg + Lig
Ki
nM
ΔG°
kcal/mole
IC50
nM
Kd
nM
EC50/IC50
nM
koff
s-1
kon
M-1s-1
pHTemp
°C
Tissue-type plasminogen activator
(Homo sapiens (Human))
BDBM298073
(3-[5-(2-phenylethyl)-1,3,4-oxadiazol-2-yl]-7-(pipe...)
Show SMILES O=c1cc(C2CCNCC2)n2ncc(-c3nnc(CCc4ccccc4)o3)c2[nH]1
Show InChI InChI=1S/C21H22N6O2/c28-18-12-17(15-8-10-22-11-9-15)27-20(24-18)16(13-23-27)21-26-25-19(29-21)7-6-14-4-2-1-3-5-14/h1-5,12-13,15,22H,6-11H2,(H,24,28)
NCI pathway
Reactome pathway
US Patent
n/an/a 10n/an/an/an/an/an/a
BAYER PHARMA AKTIENGESELLSCHAFT
US Patent
Assay Description
The clot-lysis test system configures the kinetics of clot formation and degradation in vitro and allows quantifying modulation of the process by sel...
US Patent US10118930 (2018)
BindingDB Entry DOI: 10.7270/Q2QC05J5