null
SMILES: COC[C@@](C)(F)CN1[C@H](C)Cc2c(ccc3[nH]ncc23)[C@H]1c1ccc(OC2CN(CCCF)C2)cc1OC
InChI Key:
Activity Spreadsheet -- Enzyme Inhibition Constant Data from BindingDB
Found 2 hits for monomerid = 300944
Trg + Lig
Ki
nM
ΔG°
kcal/mole
IC50
nM
Kd
nM
EC50/IC50
nM
koff
s-1
kon
M-1s-1
pHTemp
°C
Estrogen receptor
(Homo sapiens (Human))
BDBM300944
(US10131663, Example 13)
Show SMILES COC[C@@](C)(F)CN1[C@H](C)Cc2c(ccc3[nH]ncc23)[C@H]1c1ccc(OC2CN(CCCF)C2)cc1OC |r|
US Patent
n/an/a 0.110n/an/an/an/an/an/a
AstraZeneca AB
US Patent
Assay Description
The ability of compounds to down-regulate Estrogen Receptor (ER) numbers was assessed in a cell based immuno-fluorescence assay using the MCF-7 human...
US Patent US10131663 (2018)
BindingDB Entry DOI: 10.7270/Q2P55QJ9
Estrogen receptor
(Homo sapiens (Human))
BDBM300944
(US10131663, Example 13)
Show SMILES COC[C@@](C)(F)CN1[C@H](C)Cc2c(ccc3[nH]ncc23)[C@H]1c1ccc(OC2CN(CCCF)C2)cc1OC |r|
US Patent
n/an/a 3.5n/an/an/an/an/an/a
AstraZeneca AB
US Patent
Assay Description
The assay principle is that ER alpha-LBD (GST) is added to a fluorescent ligand to form a receptor/fluorophore complex. A terbium-labelled anti-GST a...
US Patent US10131663 (2018)
BindingDB Entry DOI: 10.7270/Q2P55QJ9