BDBM30264 carboline analog, 76
SMILES: CC1CNC(=O)c2[nH]c3ccc(cc3c12)C(=O)Nc1nc(cs1)C(=O)NCCN(C)C
InChI Key: InChIKey=QWFFPYQWUWLDBV-UHFFFAOYSA-N
Data: 1 IC50
PDB links: 1 PDB ID matches this monomer.
Activity Spreadsheet -- Enzyme Inhibition Constant Data from BindingDB
Found 1 hit for monomerid = 30264
Trg + Lig
Ki
nM
ΔG°
kcal/mole
IC50
nM
Kd
nM
EC50/IC50
nM
koff
s-1
kon
M-1s-1
pHTemp
°C
MAPK-Activated Protein Kinase 2 (MK2)
(Homo sapiens (Human))
BDBM30264
(carboline analog, 76)
Show SMILES CC1CNC(=O)c2[nH]c3ccc(cc3c12)C(=O)Nc1nc(cs1)C(=O)NCCN(C)C
Show InChI InChI=1S/C21H24N6O3S/c1-11-9-23-20(30)17-16(11)13-8-12(4-5-14(13)24-17)18(28)26-21-25-15(10-31-21)19(29)22-6-7-27(2)3/h4-5,8,10-11,24H,6-7,9H2,1-3H3,(H,22,29)(H,23,30)(H,25,26,28)
Reactome pathway
n/an/a 34n/an/an/an/an/an/a
Boehringer Ingelheim Pharmaceuticals Inc.
Assay Description
Diluted compounds and activated GST-MK2 were incubated in neutravidin coated plates (Pierce) in reaction buffer containing biotinylated GST-LSP1 and ...
Bioorg Med Chem Lett 17: 4664-9 (2007)
Article DOI: 10.1016/j.bmcl.2007.05.101
BindingDB Entry DOI: 10.7270/Q23N21QP
3D
3D Structure (crystal)