BDBM307618 2-(6-(4-cyclopropyl- 4H-1,2,4-triazol-3- yl)pyridin-2-yl)-5- (4- methylpiperazine-1- carbonyl)isoindolin- 1-one::US10150755, Compound 10
SMILES: CN1CCN(CC1)C(=O)c1ccc2C(=O)N(Cc2c1)c1cccc(n1)-c1nncn1C1CC1
InChI Key: InChIKey=ZXOKMAZFMHWGSW-UHFFFAOYSA-N
Data: 1 KI  3 IC50
Activity Spreadsheet -- Enzyme Inhibition Constant Data from BindingDB
Found 4 hits for monomerid = 307618
Trg + Lig
Ki
nM
ΔG°
kcal/mole
IC50
nM
Kd
nM
EC50/IC50
nM
koff
s-1
kon
M-1s-1
pHTemp
°C
Mitogen-activated protein kinase kinase kinase 5
(Homo sapiens (Human))
BDBM307618
(2-(6-(4-cyclopropyl- 4H-1,2,4-triazol-3- yl)pyridi...)
Show SMILES CN1CCN(CC1)C(=O)c1ccc2C(=O)N(Cc2c1)c1cccc(n1)-c1nncn1C1CC1
Show InChI InChI=1S/C24H25N7O2/c1-28-9-11-29(12-10-28)23(32)16-5-8-19-17(13-16)14-30(24(19)33)21-4-2-3-20(26-21)22-27-25-15-31(22)18-6-7-18/h2-5,8,13,15,18H,6-7,9-12,14H2,1H3
US Patent
<200n/an/an/an/an/an/an/an/a
SEAL ROCK THERAPEUTICS, INC.
US Patent
Assay Description
The ASK1 enzymatic assay was run following Promega ASK1 Kinase Enzyme System (Cat #V3881). The kit provides the protocol, enzymes and all reagents ne...
US Patent US10150755 (2018)
BindingDB Entry DOI: 10.7270/Q2125VQ8
Mitogen-activated protein kinase kinase kinase 5
(Homo sapiens (Human))
BDBM307618
(2-(6-(4-cyclopropyl- 4H-1,2,4-triazol-3- yl)pyridi...)
Show SMILES CN1CCN(CC1)C(=O)c1ccc2C(=O)N(Cc2c1)c1cccc(n1)-c1nncn1C1CC1
Show InChI InChI=1S/C24H25N7O2/c1-28-9-11-29(12-10-28)23(32)16-5-8-19-17(13-16)14-30(24(19)33)21-4-2-3-20(26-21)22-27-25-15-31(22)18-6-7-18/h2-5,8,13,15,18H,6-7,9-12,14H2,1H3
US Patent
n/an/a<200n/an/an/an/an/an/a
SEAL ROCK THERAPEUTICS, INC.
US Patent
Assay Description
The ASK1 enzymatic assay was run following Promega ASK1 Kinase Enzyme System (Cat #V3881). The kit provides the protocol, enzymes and all reagents ne...
US Patent US10150755 (2018)
BindingDB Entry DOI: 10.7270/Q27P91GS
Tumor necrosis factor
(Homo sapiens (Human))
BDBM307618
(2-(6-(4-cyclopropyl- 4H-1,2,4-triazol-3- yl)pyridi...)
Show SMILES CN1CCN(CC1)C(=O)c1ccc2C(=O)N(Cc2c1)c1cccc(n1)-c1nncn1C1CC1
Show InChI InChI=1S/C24H25N7O2/c1-28-9-11-29(12-10-28)23(32)16-5-8-19-17(13-16)14-30(24(19)33)21-4-2-3-20(26-21)22-27-25-15-31(22)18-6-7-18/h2-5,8,13,15,18H,6-7,9-12,14H2,1H3
Reactome pathway
US Patent
n/an/a 6.00E+3n/an/an/an/an/an/a
SEAL ROCK THERAPEUTICS, INC.
US Patent
Assay Description
Cryopreserved human PBMCs were obtained from AllCells (cat# PB003F). After thawing/dilution protocols using RPMI medium supplemented with 5% FBS (hea...
US Patent US10150755 (2018)
BindingDB Entry DOI: 10.7270/Q27P91GS
Tumor necrosis factor
(Homo sapiens (Human))
BDBM307618
(2-(6-(4-cyclopropyl- 4H-1,2,4-triazol-3- yl)pyridi...)
Show SMILES CN1CCN(CC1)C(=O)c1ccc2C(=O)N(Cc2c1)c1cccc(n1)-c1nncn1C1CC1
Show InChI InChI=1S/C24H25N7O2/c1-28-9-11-29(12-10-28)23(32)16-5-8-19-17(13-16)14-30(24(19)33)21-4-2-3-20(26-21)22-27-25-15-31(22)18-6-7-18/h2-5,8,13,15,18H,6-7,9-12,14H2,1H3
Reactome pathway
US Patent
n/an/a 600n/an/an/an/an/an/a
SEAL ROCK THERAPEUTICS, INC.
US Patent
Assay Description
Cryopreserved human PBMCs were obtained from AllCells (cat# PB003F). After thawing/dilution protocols using RPMI medium supplemented with 5% FBS (hea...
US Patent US10150755 (2018)
BindingDB Entry DOI: 10.7270/Q2125VQ8