null
SMILES: Cc1cccc2c(noc12)C(C)(C)NC(=O)[C@@H]1[C@H]2CNC[C@@H]12
InChI Key: InChIKey=DEWGUMCLXFSVQC-ITGUQSILSA-N
Activity Spreadsheet -- Enzyme Inhibition Constant Data from BindingDB
Found 2 hits for monomerid = 311956
Trg + Lig
Ki
nM
ΔG°
kcal/mole
IC50
nM
Kd
nM
EC50/IC50
nM
koff
s-1
kon
M-1s-1
pHTemp
°C
Somatostatin receptor type 4
(Homo sapiens (Human))
BDBM311956
(US10166214, Example 92 | US10675268, Example 92)
Show SMILES Cc1cccc2c(noc12)C(C)(C)NC(=O)[C@@H]1[C@H]2CNC[C@@H]12 |r|
Show InChI InChI=1S/C17H21N3O2/c1-9-5-4-6-10-14(9)22-20-15(10)17(2,3)19-16(21)13-11-7-18-8-12(11)13/h4-6,11-13,18H,7-8H2,1-3H3,(H,19,21)/t11-,12+,13+
US Patent
n/an/an/an/a 0.400n/an/an/an/a
Centrexion Therapeutics Corporation
US Patent
Assay Description
The activation of the SSTR4 receptor (Gi coupled) causes an inhibition of intracellular cAMP after stimulation with Forskolin, which can be quantifia...
US Patent US10675268 (2020)
BindingDB Entry DOI: 10.7270/Q21C20XK
Somatostatin receptor type 4
(Homo sapiens (Human))
BDBM311956
(US10166214, Example 92 | US10675268, Example 92)
Show SMILES Cc1cccc2c(noc12)C(C)(C)NC(=O)[C@@H]1[C@H]2CNC[C@@H]12 |r|
Show InChI InChI=1S/C17H21N3O2/c1-9-5-4-6-10-14(9)22-20-15(10)17(2,3)19-16(21)13-11-7-18-8-12(11)13/h4-6,11-13,18H,7-8H2,1-3H3,(H,19,21)/t11-,12+,13+
US Patent
n/an/an/an/a 0.400n/an/an/an/a
Centrexion Therapeutics Corporation
US Patent
Assay Description
The activation of the SSTR4 receptor (Gi coupled) causes an inhibition of intracellular cAMP after stimulation with Forskolin, which can be quantifia...
US Patent US10166214 (2019)
BindingDB Entry DOI: 10.7270/Q2D50Q16