BDBM317878 US10399976, Compound 31::US10807980, Compound 31::US9624217, Compound 31
SMILES: CCS(=O)(=O)c1ccc(CNC(=O)c2cnc3[C@H](C(C)C)N(Cc4ccc(cc4)C(F)(F)F)[C@@H](C)c3c2)cc1
InChI Key: InChIKey=WTCAAPUABVDGPL-PPHZAIPVSA-N
Data: 3 KI  2 IC50
Activity Spreadsheet -- Enzyme Inhibition Constant Data from BindingDB
Found 5 hits for monomerid = 317878
Trg + Lig
Ki
nM
ΔG°
kcal/mole
IC50
nM
Kd
nM
EC50/IC50
nM
koff
s-1
kon
M-1s-1
pHTemp
°C
Nuclear receptor ROR-gamma (RORC)
(Homo sapiens (Human))
BDBM317878
(US10399976, Compound 31 | US10807980, Compound 31 ...)
Show SMILES CCS(=O)(=O)c1ccc(CNC(=O)c2cnc3[C@H](C(C)C)N(Cc4ccc(cc4)C(F)(F)F)[C@@H](C)c3c2)cc1 |r|
Show InChI InChI=1S/C29H32F3N3O3S/c1-5-39(37,38)24-12-8-20(9-13-24)15-34-28(36)22-14-25-19(4)35(27(18(2)3)26(25)33-16-22)17-21-6-10-23(11-7-21)29(30,31)32/h6-14,16,18-19,27H,5,15,17H2,1-4H3,(H,34,36)/t19-,27-/m0/s1
US Patent
<100n/an/an/an/an/an/an/an/a
Vitae Pharmaceuticals, LLC
US Patent
Assay Description
Compounds of the present invention were tested for ability to bind to RORγ in a cell-free competition assay with commercially available radio-li...
US Patent US10807980 (2020)
Nuclear receptor ROR-gamma (RORC)
(Homo sapiens (Human))
BDBM317878
(US10399976, Compound 31 | US10807980, Compound 31 ...)
Show SMILES CCS(=O)(=O)c1ccc(CNC(=O)c2cnc3[C@H](C(C)C)N(Cc4ccc(cc4)C(F)(F)F)[C@@H](C)c3c2)cc1 |r|
Show InChI InChI=1S/C29H32F3N3O3S/c1-5-39(37,38)24-12-8-20(9-13-24)15-34-28(36)22-14-25-19(4)35(27(18(2)3)26(25)33-16-22)17-21-6-10-23(11-7-21)29(30,31)32/h6-14,16,18-19,27H,5,15,17H2,1-4H3,(H,34,36)/t19-,27-/m0/s1
US Patent
<100n/an/an/an/an/an/an/an/a
Vitae Pharmaceuticals, LLC
US Patent
Assay Description
Compounds of the present invention were tested for ability to bind to ROR gamma in a cell-free competition assay with commercially available radio-li...
US Patent US10399976 (2019)
BindingDB Entry DOI: 10.7270/Q2F76FXT
Nuclear receptor ROR-gamma (RORC)
(Homo sapiens (Human))
BDBM317878
(US10399976, Compound 31 | US10807980, Compound 31 ...)
Show SMILES CCS(=O)(=O)c1ccc(CNC(=O)c2cnc3[C@H](C(C)C)N(Cc4ccc(cc4)C(F)(F)F)[C@@H](C)c3c2)cc1 |r|
Show InChI InChI=1S/C29H32F3N3O3S/c1-5-39(37,38)24-12-8-20(9-13-24)15-34-28(36)22-14-25-19(4)35(27(18(2)3)26(25)33-16-22)17-21-6-10-23(11-7-21)29(30,31)32/h6-14,16,18-19,27H,5,15,17H2,1-4H3,(H,34,36)/t19-,27-/m0/s1
US Patent
<100n/an/an/an/an/an/an/an/a
Vitae Pharmaceuticals, Inc.
US Patent
Assay Description
Compounds of the present invention were tested for ability to bind to RORγ in a cell-free competition assay with commercially available radio-li...
US Patent US9624217 (2017)
BindingDB Entry DOI: 10.7270/Q29P33RJ
Nuclear receptor ROR-gamma (RORC)
(Homo sapiens (Human))
BDBM317878
(US10399976, Compound 31 | US10807980, Compound 31 ...)
Show SMILES CCS(=O)(=O)c1ccc(CNC(=O)c2cnc3[C@H](C(C)C)N(Cc4ccc(cc4)C(F)(F)F)[C@@H](C)c3c2)cc1 |r|
Show InChI InChI=1S/C29H32F3N3O3S/c1-5-39(37,38)24-12-8-20(9-13-24)15-34-28(36)22-14-25-19(4)35(27(18(2)3)26(25)33-16-22)17-21-6-10-23(11-7-21)29(30,31)32/h6-14,16,18-19,27H,5,15,17H2,1-4H3,(H,34,36)/t19-,27-/m0/s1
US Patent
n/an/a<100n/an/an/an/an/an/a
Vitae Pharmaceuticals, LLC
US Patent
Assay Description
Compounds of the present invention were tested for RORγ inverse agonist activity in a cell-based, transcriptional activity assay. Secreted Nanol...
US Patent US10807980 (2020)
Nuclear receptor ROR-gamma (RORC)
(Homo sapiens (Human))
BDBM317878
(US10399976, Compound 31 | US10807980, Compound 31 ...)
Show SMILES CCS(=O)(=O)c1ccc(CNC(=O)c2cnc3[C@H](C(C)C)N(Cc4ccc(cc4)C(F)(F)F)[C@@H](C)c3c2)cc1 |r|
Show InChI InChI=1S/C29H32F3N3O3S/c1-5-39(37,38)24-12-8-20(9-13-24)15-34-28(36)22-14-25-19(4)35(27(18(2)3)26(25)33-16-22)17-21-6-10-23(11-7-21)29(30,31)32/h6-14,16,18-19,27H,5,15,17H2,1-4H3,(H,34,36)/t19-,27-/m0/s1
US Patent
n/an/a<100n/an/an/an/an/an/a
Vitae Pharmaceuticals, LLC
US Patent
Assay Description
Compounds of the present invention were tested for ROR gamma inverse agonist activity in a cell-based, transcriptional activity assay. Secreted Nanol...
US Patent US10399976 (2019)
BindingDB Entry DOI: 10.7270/Q2F76FXT