BDBM32641 amino-oxazole, 2c
SMILES: Nc1ncc(o1)C(=O)N(Cc1ccccc1)Cc1ccccc1
InChI Key: InChIKey=KIJXWOGFYAWTNC-UHFFFAOYSA-N
Data: 1 IC50
PDB links: 1 PDB ID matches this monomer.
Activity Spreadsheet -- Enzyme Inhibition Constant Data from BindingDB
Found 1 hit for monomerid = 32641
Trg + Lig
Ki
nM
ΔG°
kcal/mole
IC50
nM
Kd
nM
EC50/IC50
nM
koff
s-1
kon
M-1s-1
pHTemp
°C
Biotin Carboxylase
(Escherichia coli (strain K12))
BDBM32641
(amino-oxazole, 2c)
Show SMILES Nc1ncc(o1)C(=O)N(Cc1ccccc1)Cc1ccccc1
Show InChI InChI=1S/C18H17N3O2/c19-18-20-11-16(23-18)17(22)21(12-14-7-3-1-4-8-14)13-15-9-5-2-6-10-15/h1-11H,12-13H2,(H2,19,20)
n/an/a 125n/an/an/an/a8.023
Pfizer
Assay Description
Assays were performed in 384-well clear bottom plates (Corning; catalog no. 3702), that contained inhibitor solvated in DMSO. To each well of the pla...
ACS Chem Biol 4: 473-83 (2009)
Article DOI: 10.1021/cb9000102
BindingDB Entry DOI: 10.7270/Q2WM1BR8
3D
3D Structure (crystal)