BDBM331340 2-[5-(Dimethyl-1H-1,2,3-triazol-5-yl)-8-[(S)-oxan-4-yl(phenyl)methyl]-3,8,10-triazatricyclo[7.4.0.02,7]trideca-1(9),2::BDBM331341::US9725449, Example 174
SMILES: Cc1nnn(C)c1-c1cnc2c(c1)n([C@@H](C1CCOCC1)c1ccccc1)c1nc(ccc21)C(C)(C)O
InChI Key: InChIKey=LOGSXSPGJZALJC-HHHXNRCGSA-N
Data: 3 IC50
Activity Spreadsheet -- Enzyme Inhibition Constant Data from BindingDB
Found 3 hits for monomerid = 331340
Trg + Lig
Ki
nM
ΔG°
kcal/mole
IC50
nM
Kd
nM
EC50/IC50
nM
koff
s-1
kon
M-1s-1
pHTemp
°C
Bromodomain BRD4
(Homo sapiens (Human))
BDBM331340
(2-[5-(Dimethyl-1H-1,2,3-triazol-5-yl)-8-[(S)-oxan-...)
Show SMILES Cc1nnn(C)c1-c1cnc2c(c1)n([C@@H](C1CCOCC1)c1ccccc1)c1nc(ccc21)C(C)(C)O |r|
Show InChI InChI=1S/C29H32N6O2/c1-18-26(34(4)33-32-18)21-16-23-25(30-17-21)22-10-11-24(29(2,3)36)31-28(22)35(23)27(19-8-6-5-7-9-19)20-12-14-37-15-13-20/h5-11,16-17,20,27,36H,12-15H2,1-4H3/t27-/m1/s1
Reactome pathway
US Patent
n/an/a<1n/an/an/an/an/an/a
Bristol-Myers Squibb Company
US Patent
Assay Description
The binding of compounds to bromodomain BRD4 (44-168), BRD4 (333-460), and BRD4 (1-477 or 44-460) was assessed using a time resolved fluorescent reso...
US Patent US9725449 (2017)
BindingDB Entry DOI: 10.7270/Q2P55QM6
Bromodomain BRD4
(Homo sapiens (Human))
BDBM331340
(2-[5-(Dimethyl-1H-1,2,3-triazol-5-yl)-8-[(S)-oxan-...)
Show SMILES Cc1nnn(C)c1-c1cnc2c(c1)n([C@@H](C1CCOCC1)c1ccccc1)c1nc(ccc21)C(C)(C)O |r|
Show InChI InChI=1S/C29H32N6O2/c1-18-26(34(4)33-32-18)21-16-23-25(30-17-21)22-10-11-24(29(2,3)36)31-28(22)35(23)27(19-8-6-5-7-9-19)20-12-14-37-15-13-20/h5-11,16-17,20,27,36H,12-15H2,1-4H3/t27-/m1/s1
Reactome pathway
US Patent
n/an/a<1n/an/an/an/an/an/a
Bristol-Myers Squibb Company
US Patent
Assay Description
The binding of compounds to bromodomain BRD4 (44-168), BRD4 (333-460), and BRD4 (1-477 or 44-460) was assessed using a time resolved fluorescent reso...
US Patent US9725449 (2017)
BindingDB Entry DOI: 10.7270/Q2P55QM6
Bromodomain BRD4
(Homo sapiens (Human))
BDBM331340
(2-[5-(Dimethyl-1H-1,2,3-triazol-5-yl)-8-[(S)-oxan-...)
Show SMILES Cc1nnn(C)c1-c1cnc2c(c1)n([C@@H](C1CCOCC1)c1ccccc1)c1nc(ccc21)C(C)(C)O |r|
Show InChI InChI=1S/C29H32N6O2/c1-18-26(34(4)33-32-18)21-16-23-25(30-17-21)22-10-11-24(29(2,3)36)31-28(22)35(23)27(19-8-6-5-7-9-19)20-12-14-37-15-13-20/h5-11,16-17,20,27,36H,12-15H2,1-4H3/t27-/m1/s1
Reactome pathway
US Patent
n/an/a<10n/an/an/an/an/an/a
Bristol-Myers Squibb Company
US Patent
Assay Description
The binding of compounds to bromodomain BRD4 (44-168), BRD4 (333-460), and BRD4 (1-477 or 44-460) was assessed using a time resolved fluorescent reso...
US Patent US9725449 (2017)
BindingDB Entry DOI: 10.7270/Q2P55QM6