null
SMILES: OC(CNC(=O)COc1cccc(NC2CCOCC2)c1)CN1CCc2ccccc2C1
InChI Key: InChIKey=OAMWDJZRBPSBOE-UHFFFAOYSA-N
Activity Spreadsheet -- Enzyme Inhibition Constant Data from BindingDB
Found 2 hits for monomerid = 337047
Trg + Lig
Ki
nM
ΔG°
kcal/mole
IC50
nM
Kd
nM
EC50/IC50
nM
koff
s-1
kon
M-1s-1
pHTemp
°C
Protein arginine N-methyltransferase 5
(Homo sapiens (Human))
BDBM337047
(US9745291, Compound 93 | US9765068, Compound 93)
Show SMILES OC(CNC(=O)COc1cccc(NC2CCOCC2)c1)CN1CCc2ccccc2C1
Show InChI InChI=1S/C25H33N3O4/c29-23(17-28-11-8-19-4-1-2-5-20(19)16-28)15-26-25(30)18-32-24-7-3-6-22(14-24)27-21-9-12-31-13-10-21/h1-7,14,21,23,27,29H,8-13,15-18H2,(H,26,30)
US Patent
n/an/a<100n/an/an/an/an/an/a
Epizyme, Inc.
US Patent
Assay Description
Molecular Biology: Full-length human PRMT5 (NM_006109.3) transcript variant 1 clone was amplified from a fetal brain cDNA library, incorporating flan...
US Patent US9765068 (2017)
BindingDB Entry DOI: 10.7270/Q2959KN3
Methylosome protein 50/Protein arginine N-methyltransferase 5
(Homo sapiens (Human))
BDBM337047
(US9745291, Compound 93 | US9765068, Compound 93)
Show SMILES OC(CNC(=O)COc1cccc(NC2CCOCC2)c1)CN1CCc2ccccc2C1
Show InChI InChI=1S/C25H33N3O4/c29-23(17-28-11-8-19-4-1-2-5-20(19)16-28)15-26-25(30)18-32-24-7-3-6-22(14-24)27-21-9-12-31-13-10-21/h1-7,14,21,23,27,29H,8-13,15-18H2,(H,26,30)
US Patent
n/an/a<100n/an/an/an/an/an/a
Epizyme, Inc.
US Patent
Assay Description
The assays were all performed in a buffer consisting of 20 mM Bicine (pH=7.6), 1 mM TCEP, 0.005% BSG, and 0.002% Tween20, prepared on the day of use....
US Patent US9745291 (2017)
BindingDB Entry DOI: 10.7270/Q2J1058K