BDBM337052 US9745291, Compound 98::US9765068, Compound 98
SMILES: COc1ccc2cccc(OCC(=O)NC[C@@H](O)CN3CCc4ccccc4C3)c2n1
InChI Key: InChIKey=UGLJLGAPPPJZLG-HXUWFJFHSA-N
Data: 2 IC50
Activity Spreadsheet -- Enzyme Inhibition Constant Data from BindingDB
Found 2 hits for monomerid = 337052
Trg + Lig
Ki
nM
ΔG°
kcal/mole
IC50
nM
Kd
nM
EC50/IC50
nM
koff
s-1
kon
M-1s-1
pHTemp
°C
Protein arginine N-methyltransferase 5
(Homo sapiens (Human))
BDBM337052
(US9745291, Compound 98 | US9765068, Compound 98)
Show SMILES COc1ccc2cccc(OCC(=O)NC[C@@H](O)CN3CCc4ccccc4C3)c2n1 |r|
Show InChI InChI=1S/C24H27N3O4/c1-30-23-10-9-18-7-4-8-21(24(18)26-23)31-16-22(29)25-13-20(28)15-27-12-11-17-5-2-3-6-19(17)14-27/h2-10,20,28H,11-16H2,1H3,(H,25,29)/t20-/m1/s1
US Patent
n/an/a<100n/an/an/an/an/an/a
Epizyme, Inc.
US Patent
Assay Description
Molecular Biology: Full-length human PRMT5 (NM_006109.3) transcript variant 1 clone was amplified from a fetal brain cDNA library, incorporating flan...
US Patent US9765068 (2017)
BindingDB Entry DOI: 10.7270/Q2959KN3
Methylosome protein 50/Protein arginine N-methyltransferase 5
(Homo sapiens (Human))
BDBM337052
(US9745291, Compound 98 | US9765068, Compound 98)
Show SMILES COc1ccc2cccc(OCC(=O)NC[C@@H](O)CN3CCc4ccccc4C3)c2n1 |r|
Show InChI InChI=1S/C24H27N3O4/c1-30-23-10-9-18-7-4-8-21(24(18)26-23)31-16-22(29)25-13-20(28)15-27-12-11-17-5-2-3-6-19(17)14-27/h2-10,20,28H,11-16H2,1H3,(H,25,29)/t20-/m1/s1
US Patent
n/an/a<100n/an/an/an/an/an/a
Epizyme, Inc.
US Patent
Assay Description
The assays were all performed in a buffer consisting of 20 mM Bicine (pH=7.6), 1 mM TCEP, 0.005% BSG, and 0.002% Tween20, prepared on the day of use....
US Patent US9745291 (2017)
BindingDB Entry DOI: 10.7270/Q2J1058K