BDBM34099 benzamide derivative, 14c
SMILES: Fc1cccc(NC(=O)CN2CCN(CC2)c2ccccc2F)c1
InChI Key: InChIKey=ZIDQBSOXRCGTOJ-UHFFFAOYSA-N
Data: 1 IC50
Activity Spreadsheet -- Enzyme Inhibition Constant Data from BindingDB
Found 2 hits for monomerid = 34099
Trg + Lig
Ki
nM
ΔG°
kcal/mole
IC50
nM
Kd
nM
EC50/IC50
nM
koff
s-1
kon
M-1s-1
pHTemp
°C
Glucokinase/Glucokinase regulatory protein
(Homo sapiens (Human))
BDBM34099
(benzamide derivative, 14c)
Show SMILES Fc1cccc(NC(=O)CN2CCN(CC2)c2ccccc2F)c1
Show InChI InChI=1S/C18H19F2N3O/c19-14-4-3-5-15(12-14)21-18(24)13-22-8-10-23(11-9-22)17-7-2-1-6-16(17)20/h1-7,12H,8-11,13H2,(H,21,24)
NCI pathway
Reactome pathway
n/an/an/an/an/an/an/an/an/a
Shanghai Institutes for Biological Sciences
Assay Description
The GK activity was assessed spectrometrically by a coupled reaction with glucose-6-phosphate dehydrogenase (G6PDH). Briefly, GK catalyzes glucose ph...
Bioorg Med Chem 17: 7301-12 (2009)
Article DOI: 10.1016/j.bmc.2009.08.045
BindingDB Entry DOI: 10.7270/Q2DF6PK0
Glycogen Phosphorylase (PYGM)
(Oryctolagus cuniculus (rabbit))
BDBM34099
(benzamide derivative, 14c)
Show SMILES Fc1cccc(NC(=O)CN2CCN(CC2)c2ccccc2F)c1
Show InChI InChI=1S/C18H19F2N3O/c19-14-4-3-5-15(12-14)21-18(24)13-22-8-10-23(11-9-22)17-7-2-1-6-16(17)20/h1-7,12H,8-11,13H2,(H,21,24)
n/an/a 1.87E+4n/an/an/an/a7.222
Shanghai Institutes for Biological Sciences
Assay Description
The enzymatic inhibition of phosphorylase activity was monitored using microplate reader (Bio-Rad). In brief, GPa activity was measured in the direct...
Bioorg Med Chem 17: 7301-12 (2009)
Article DOI: 10.1016/j.bmc.2009.08.045
BindingDB Entry DOI: 10.7270/Q2DF6PK0