BDBM34102 benzamide derivative 15b
SMILES: COc1cccc(NC(=O)c2cccc(c2)C(=O)Nc2cccc(OC)c2)c1
InChI Key: InChIKey=KSLPIXQLWACJBY-UHFFFAOYSA-N
Data: 1 IC50
Activity Spreadsheet -- Enzyme Inhibition Constant Data from BindingDB
Found 2 hits for monomerid = 34102
Trg + Lig
Ki
nM
ΔG°
kcal/mole
IC50
nM
Kd
nM
EC50/IC50
nM
koff
s-1
kon
M-1s-1
pHTemp
°C
Glucokinase/Glucokinase regulatory protein
(Homo sapiens (Human))
BDBM34102
(benzamide derivative 15b)
Show SMILES COc1cccc(NC(=O)c2cccc(c2)C(=O)Nc2cccc(OC)c2)c1
Show InChI InChI=1S/C22H20N2O4/c1-27-19-10-4-8-17(13-19)23-21(25)15-6-3-7-16(12-15)22(26)24-18-9-5-11-20(14-18)28-2/h3-14H,1-2H3,(H,23,25)(H,24,26)
NCI pathway
Reactome pathway
n/an/an/an/an/an/an/an/an/a
Shanghai Institutes for Biological Sciences
Assay Description
The GK activity was assessed spectrometrically by a coupled reaction with glucose-6-phosphate dehydrogenase (G6PDH). Briefly, GK catalyzes glucose ph...
Bioorg Med Chem 17: 7301-12 (2009)
Article DOI: 10.1016/j.bmc.2009.08.045
BindingDB Entry DOI: 10.7270/Q2DF6PK0
Glycogen Phosphorylase (PYGM)
(Oryctolagus cuniculus (rabbit))
BDBM34102
(benzamide derivative 15b)
Show SMILES COc1cccc(NC(=O)c2cccc(c2)C(=O)Nc2cccc(OC)c2)c1
Show InChI InChI=1S/C22H20N2O4/c1-27-19-10-4-8-17(13-19)23-21(25)15-6-3-7-16(12-15)22(26)24-18-9-5-11-20(14-18)28-2/h3-14H,1-2H3,(H,23,25)(H,24,26)
n/an/a 7.74E+4n/an/an/an/an/an/a
Shanghai Institutes for Biological Sciences
Assay Description
The enzymatic inhibition of phosphorylase activity was monitored using microplate reader (Bio-Rad). In brief, GPa activity was measured in the direct...
Bioorg Med Chem 17: 7301-12 (2009)
Article DOI: 10.1016/j.bmc.2009.08.045
BindingDB Entry DOI: 10.7270/Q2DF6PK0