null
SMILES: CC(C)Nc1cc(ncc1-c1cnn(CCC(C)(C)O)c1)-c1cnc2cc(cnn12)C#N
InChI Key: InChIKey=XOYXADDAQJVPEI-UHFFFAOYSA-N
Activity Spreadsheet -- Enzyme Inhibition Constant Data from BindingDB
Found 1 hit for monomerid = 347072
Trg + Lig
Ki
nM
ΔG°
kcal/mole
IC50
nM
Kd
nM
EC50/IC50
nM
koff
s-1
kon
M-1s-1
pHTemp
°C
G protein-activated inward rectifier potassium channel 4
(Homo sapiens (Human))
BDBM347072
(3-(5-(1-(3-hydroxy-3-methylbutyl)-1H-pyrazol-4-yl)...)
Show SMILES CC(C)Nc1cc(ncc1-c1cnn(CCC(C)(C)O)c1)-c1cnc2cc(cnn12)C#N
Show InChI InChI=1S/C23H26N8O/c1-15(2)29-19-8-20(21-13-26-22-7-16(9-24)10-28-31(21)22)25-12-18(19)17-11-27-30(14-17)6-5-23(3,4)32/h7-8,10-15,32H,5-6H2,1-4H3,(H,25,29)
Reactome pathway
US Patent
n/an/a 3n/an/an/an/an/an/a
Bristol-Myers Squibb Company
US Patent
Assay Description
TBD
US Patent US10202390 (2019)
BindingDB Entry DOI: 10.7270/Q28W3GDC