null
SMILES: CC(C)S(=O)c1sc2nc(cc(-c3ccccc3)c2c1N)-c1cccs1
InChI Key: InChIKey=UYWYIJHDZITZPU-UHFFFAOYSA-N
Activity Spreadsheet -- Enzyme Inhibition Constant Data from BindingDB
Found 2 hits for monomerid = 347387
Trg + Lig
Ki
nM
ΔG°
kcal/mole
IC50
nM
Kd
nM
EC50/IC50
nM
koff
s-1
kon
M-1s-1
pHTemp
°C
15-hydroxyprostaglandin dehydrogenase [NAD(+)]
(Homo sapiens (Human))
BDBM347387
(US10869871, ID # SW208438 | US9789116, SW208438)
Show SMILES CC(C)S(=O)c1sc2nc(cc(-c3ccccc3)c2c1N)-c1cccs1
Show InChI InChI=1S/C20H18N2OS3/c1-12(2)26(23)20-18(21)17-14(13-7-4-3-5-8-13)11-15(22-19(17)25-20)16-9-6-10-24-16/h3-12H,21H2,1-2H3
Reactome pathway
US Patent
n/an/a 3.16n/an/an/an/an/an/a
CASE WESTERN RESERVE UNIVERSITY; THE BOARD OF REGENTS OF THE UNIVERSITY OF TEXAS SYSTEM
US Patent
Assay Description
Assays were done by measuring the transfer of tritium from 15(S)-[15-3H] PGE2 to glutamate (at 1 μM PGE2 substrate), or by direct fluorescence m...
US Patent US10869871 (2020)
15-hydroxyprostaglandin dehydrogenase [NAD(+)]
(Homo sapiens (Human))
BDBM347387
(US10869871, ID # SW208438 | US9789116, SW208438)
Show SMILES CC(C)S(=O)c1sc2nc(cc(-c3ccccc3)c2c1N)-c1cccs1
Show InChI InChI=1S/C20H18N2OS3/c1-12(2)26(23)20-18(21)17-14(13-7-4-3-5-8-13)11-15(22-19(17)25-20)16-9-6-10-24-16/h3-12H,21H2,1-2H3
Reactome pathway
US Patent
n/an/a 3.16n/an/an/an/an/an/a
Case Western Reserve University; Board of Regents of the University of Texas System
US Patent
Assay Description
Each compound for inhibiting enzymatic activity of recombinant 15-PGDH in an in vitro assay.
US Patent US9789116 (2017)
BindingDB Entry DOI: 10.7270/Q2VQ34T5