BDBM347419 US10869871, ID # SW209279::US9789116, SW209279
SMILES: CC(C)S(=O)c1sc2nc(cc(-c3nccn3C)c2c1N)-c1nccs1
InChI Key: InChIKey=GKXXLEPMXUMXCY-UHFFFAOYSA-N
Data: 2 IC50
Activity Spreadsheet -- Enzyme Inhibition Constant Data from BindingDB
Found 2 hits for monomerid = 347419
Trg + Lig
Ki
nM
ΔG°
kcal/mole
IC50
nM
Kd
nM
EC50/IC50
nM
koff
s-1
kon
M-1s-1
pHTemp
°C
15-hydroxyprostaglandin dehydrogenase [NAD+]
(Homo sapiens (Human))
BDBM347419
(US10869871, ID # SW209279 | US9789116, SW209279)
Show SMILES CC(C)S(=O)c1sc2nc(cc(-c3nccn3C)c2c1N)-c1nccs1
Show InChI InChI=1S/C17H17N5OS3/c1-9(2)26(23)17-13(18)12-10(14-19-4-6-22(14)3)8-11(21-16(12)25-17)15-20-5-7-24-15/h4-9H,18H2,1-3H3
Reactome pathway
US Patent
n/an/a 4.18n/an/an/an/an/an/a
CASE WESTERN RESERVE UNIVERSITY; THE BOARD OF REGENTS OF THE UNIVERSITY OF TEXAS SYSTEM
US Patent
Assay Description
Assays were done by measuring the transfer of tritium from 15(S)-[15-3H] PGE2 to glutamate (at 1 μM PGE2 substrate), or by direct fluorescence m...
US Patent US10869871 (2020)
15-hydroxyprostaglandin dehydrogenase [NAD+]
(Homo sapiens (Human))
BDBM347419
(US10869871, ID # SW209279 | US9789116, SW209279)
Show SMILES CC(C)S(=O)c1sc2nc(cc(-c3nccn3C)c2c1N)-c1nccs1
Show InChI InChI=1S/C17H17N5OS3/c1-9(2)26(23)17-13(18)12-10(14-19-4-6-22(14)3)8-11(21-16(12)25-17)15-20-5-7-24-15/h4-9H,18H2,1-3H3
Reactome pathway
US Patent
n/an/a 4.18n/an/an/an/an/an/a
Case Western Reserve University; Board of Regents of the University of Texas System
US Patent
Assay Description
Each compound for inhibiting enzymatic activity of recombinant 15-PGDH in an in vitro assay.
US Patent US9789116 (2017)
BindingDB Entry DOI: 10.7270/Q2VQ34T5