BDBM347681 (E)-2-(4-Chlorophenoxy)-1-(2- chlorophenyl)-3-(dimethylamino)prop-2-en- 1-one ::US9790217, 6
SMILES: CN(C)\C=C(\Oc1ccc(Cl)cc1)C(=O)c1ccccc1Cl
InChI Key: InChIKey=IZDJPUOABLMYKB-LFIBNONCSA-N
Data: 2 EC50
Activity Spreadsheet -- Enzyme Inhibition Constant Data from BindingDB
Found 2 hits for monomerid = 347681
Trg + Lig
Ki
nM
ΔG°
kcal/mole
IC50
nM
Kd
nM
EC50/IC50
nM
koff
s-1
kon
M-1s-1
pHTemp
°C
Cytochrome P450 11B1
(Homo sapiens (Human))
BDBM347681
((E)-2-(4-Chlorophenoxy)-1-(2- chlorophenyl)-3-(dim...)
Show SMILES CN(C)\C=C(\Oc1ccc(Cl)cc1)C(=O)c1ccccc1Cl
Show InChI InChI=1S/C17H15Cl2NO2/c1-20(2)11-16(22-13-9-7-12(18)8-10-13)17(21)14-5-3-4-6-15(14)19/h3-11H,1-2H3/b16-11+
US Patent
n/an/an/an/a 0.0520n/an/an/an/a
Hoffmann-La Roche Inc.
US Patent
Assay Description
G-402 cells can be obtained from ATCC (CRL-1440) and were originally derived from a renal leiomyoblastoma.The expression plasmids contains the ORF fo...
US Patent US9790217 (2017)
BindingDB Entry DOI: 10.7270/Q2K64M6M
Cytochrome P450 11B2 (CYP11B2)
(Homo sapiens (Human))
BDBM347681
((E)-2-(4-Chlorophenoxy)-1-(2- chlorophenyl)-3-(dim...)
Show SMILES CN(C)\C=C(\Oc1ccc(Cl)cc1)C(=O)c1ccccc1Cl
Show InChI InChI=1S/C17H15Cl2NO2/c1-20(2)11-16(22-13-9-7-12(18)8-10-13)17(21)14-5-3-4-6-15(14)19/h3-11H,1-2H3/b16-11+
US Patent
n/an/an/an/a 0.00300n/an/an/an/a
Hoffmann-La Roche Inc.
US Patent
Assay Description
G-402 cells can be obtained from ATCC (CRL-1440) and were originally derived from a renal leiomyoblastoma.The expression plasmids contains the ORF fo...
US Patent US9790217 (2017)
BindingDB Entry DOI: 10.7270/Q2K64M6M