null
SMILES: N#Cc1ccc(Oc2cn[nH]c2-c2cccc(COc3cccnn3)c2)cc1
InChI Key: InChIKey=GLEZLSUOQUYZLE-UHFFFAOYSA-N
Activity Spreadsheet -- Enzyme Inhibition Constant Data from BindingDB
Found 2 hits for monomerid = 347745
Trg + Lig
Ki
nM
ΔG°
kcal/mole
IC50
nM
Kd
nM
EC50/IC50
nM
koff
s-1
kon
M-1s-1
pHTemp
°C
Cytochrome P450 11B1, mitochondrial
(Homo sapiens (Human))
BDBM347745
(CHEM-US-00162 | US9790217, 70)
Show SMILES N#Cc1ccc(Oc2cn[nH]c2-c2cccc(COc3cccnn3)c2)cc1
Show InChI InChI=1S/C21H15N5O2/c22-12-15-6-8-18(9-7-15)28-19-13-24-26-21(19)17-4-1-3-16(11-17)14-27-20-5-2-10-23-25-20/h1-11,13H,14H2,(H,24,26)
US Patent
n/an/an/an/a 0.0380n/an/an/an/a
Hoffmann-La Roche Inc.
US Patent
Assay Description
G-402 cells can be obtained from ATCC (CRL-1440) and were originally derived from a renal leiomyoblastoma.The expression plasmids contains the ORF fo...
US Patent US9790217 (2017)
BindingDB Entry DOI: 10.7270/Q2K64M6M
Cytochrome P450 11B2, mitochondrial
(Homo sapiens (Human))
BDBM347745
(CHEM-US-00162 | US9790217, 70)
Show SMILES N#Cc1ccc(Oc2cn[nH]c2-c2cccc(COc3cccnn3)c2)cc1
Show InChI InChI=1S/C21H15N5O2/c22-12-15-6-8-18(9-7-15)28-19-13-24-26-21(19)17-4-1-3-16(11-17)14-27-20-5-2-10-23-25-20/h1-11,13H,14H2,(H,24,26)
US Patent
n/an/an/an/a 0.0110n/an/an/an/a
Hoffmann-La Roche Inc.
US Patent
Assay Description
G-402 cells can be obtained from ATCC (CRL-1440) and were originally derived from a renal leiomyoblastoma.The expression plasmids contains the ORF fo...
US Patent US9790217 (2017)
BindingDB Entry DOI: 10.7270/Q2K64M6M