BDBM349509 US10207991, Ex. Cpd. No. 24::US10611728, Example Compound 24
SMILES: C[C@H](CCc1ccc(O)c(OC(F)(F)F)c1)N1Cc2cc3OCOc3cc2C1
InChI Key: InChIKey=YYCFTPUSYYQXNV-GFCCVEGCSA-N
Data: 6 KI  1 IC50
Activity Spreadsheet -- Enzyme Inhibition Constant Data from BindingDB
Found 7 hits for monomerid = 349509
Trg + Lig
Ki
nM
ΔG°
kcal/mole
IC50
nM
Kd
nM
EC50/IC50
nM
koff
s-1
kon
M-1s-1
pHTemp
°C
Sigma non-opioid intracellular receptor 1
(Homo sapiens (Human))
BDBM349509
(US10207991, Ex. Cpd. No. 24 | US10611728, Example ...)
Show SMILES C[C@H](CCc1ccc(O)c(OC(F)(F)F)c1)N1Cc2cc3OCOc3cc2C1 |r|
Show InChI InChI=1S/C20H20F3NO4/c1-12(2-3-13-4-5-16(25)17(6-13)28-20(21,22)23)24-9-14-7-18-19(27-11-26-18)8-15(14)10-24/h4-8,12,25H,2-3,9-11H2,1H3/t12-/m1/s1
US Patent
4.90n/an/an/an/an/an/an/an/a
COGNITION THERAPEUTICS, INC.
US Patent
Assay Description
Radioligand binding assays for Sigma-1 receptors and Sigma-2 receptors were carried out by a commercial contract research organization. For Sigma-1 b...
US Patent US10611728 (2020)
Sigma non-opioid intracellular receptor 1
(Homo sapiens (Human))
BDBM349509
(US10207991, Ex. Cpd. No. 24 | US10611728, Example ...)
Show SMILES C[C@H](CCc1ccc(O)c(OC(F)(F)F)c1)N1Cc2cc3OCOc3cc2C1 |r|
Show InChI InChI=1S/C20H20F3NO4/c1-12(2-3-13-4-5-16(25)17(6-13)28-20(21,22)23)24-9-14-7-18-19(27-11-26-18)8-15(14)10-24/h4-8,12,25H,2-3,9-11H2,1H3/t12-/m1/s1
US Patent
4.90n/an/an/an/an/an/an/an/a
COGNITION THERAPEUTICS, INC.
US Patent
Assay Description
The affinity of candidate sigma-2 ligand compounds at sigma-1 and sigma-2 receptors was also determined by displacement of different known labeled si...
US Patent US10207991 (2019)
BindingDB Entry DOI: 10.7270/Q2BV7JRG
Sigma non-opioid intracellular receptor 1
(Homo sapiens (Human))
BDBM349509
(US10207991, Ex. Cpd. No. 24 | US10611728, Example ...)
Show SMILES C[C@H](CCc1ccc(O)c(OC(F)(F)F)c1)N1Cc2cc3OCOc3cc2C1 |r|
Show InChI InChI=1S/C20H20F3NO4/c1-12(2-3-13-4-5-16(25)17(6-13)28-20(21,22)23)24-9-14-7-18-19(27-11-26-18)8-15(14)10-24/h4-8,12,25H,2-3,9-11H2,1H3/t12-/m1/s1
US Patent
4.90n/an/an/an/an/an/an/an/a
COGNITION THERAPEUTICS, INC.
US Patent
Assay Description
Radioligand binding assays for Sigma-1 receptors and Sigma-2 receptors were carried out by a commercial contract research organization. For Sigma-1 b...
US Patent US9796672 (2017)
BindingDB Entry DOI: 10.7270/Q2X92DFN
Sigma intracellular receptor 2
(Homo sapiens (Human))
BDBM349509
(US10207991, Ex. Cpd. No. 24 | US10611728, Example ...)
Show SMILES C[C@H](CCc1ccc(O)c(OC(F)(F)F)c1)N1Cc2cc3OCOc3cc2C1 |r|
Show InChI InChI=1S/C20H20F3NO4/c1-12(2-3-13-4-5-16(25)17(6-13)28-20(21,22)23)24-9-14-7-18-19(27-11-26-18)8-15(14)10-24/h4-8,12,25H,2-3,9-11H2,1H3/t12-/m1/s1
US Patent
52n/an/an/an/an/an/an/an/a
COGNITION THERAPEUTICS, INC.
US Patent
Assay Description
The affinity of candidate sigma-2 ligand compounds at sigma-1 and sigma-2 receptors was also determined by displacement of different known labeled si...
US Patent US10207991 (2019)
BindingDB Entry DOI: 10.7270/Q2BV7JRG
Sigma intracellular receptor 2
(Homo sapiens (Human))
BDBM349509
(US10207991, Ex. Cpd. No. 24 | US10611728, Example ...)
Show SMILES C[C@H](CCc1ccc(O)c(OC(F)(F)F)c1)N1Cc2cc3OCOc3cc2C1 |r|
Show InChI InChI=1S/C20H20F3NO4/c1-12(2-3-13-4-5-16(25)17(6-13)28-20(21,22)23)24-9-14-7-18-19(27-11-26-18)8-15(14)10-24/h4-8,12,25H,2-3,9-11H2,1H3/t12-/m1/s1
US Patent
52n/an/an/an/an/an/an/an/a
COGNITION THERAPEUTICS, INC.
US Patent
Assay Description
Radioligand binding assays for Sigma-1 receptors and Sigma-2 receptors were carried out by a commercial contract research organization. For Sigma-1 b...
US Patent US9796672 (2017)
BindingDB Entry DOI: 10.7270/Q2X92DFN
Sigma intracellular receptor 2
(Homo sapiens (Human))
BDBM349509
(US10207991, Ex. Cpd. No. 24 | US10611728, Example ...)
Show SMILES C[C@H](CCc1ccc(O)c(OC(F)(F)F)c1)N1Cc2cc3OCOc3cc2C1 |r|
Show InChI InChI=1S/C20H20F3NO4/c1-12(2-3-13-4-5-16(25)17(6-13)28-20(21,22)23)24-9-14-7-18-19(27-11-26-18)8-15(14)10-24/h4-8,12,25H,2-3,9-11H2,1H3/t12-/m1/s1
US Patent
52n/an/an/an/an/an/an/an/a
COGNITION THERAPEUTICS, INC.
US Patent
Assay Description
Radioligand binding assays for Sigma-1 receptors and Sigma-2 receptors were carried out by a commercial contract research organization. For Sigma-1 b...
US Patent US10611728 (2020)
Melanin-concentrating hormone receptor 2/HERG
(Homo sapiens (Human))
BDBM349509
(US10207991, Ex. Cpd. No. 24 | US10611728, Example ...)
Show SMILES C[C@H](CCc1ccc(O)c(OC(F)(F)F)c1)N1Cc2cc3OCOc3cc2C1 |r|
Show InChI InChI=1S/C20H20F3NO4/c1-12(2-3-13-4-5-16(25)17(6-13)28-20(21,22)23)24-9-14-7-18-19(27-11-26-18)8-15(14)10-24/h4-8,12,25H,2-3,9-11H2,1H3/t12-/m1/s1
Reactome pathway
US Patent
n/an/a 860n/an/an/an/an/an/a
COGNITION THERAPEUTICS, INC.
US Patent
Assay Description
Representative sigma-2 antagonists test compounds do not induce neuronal or glial toxicity with acute or chronic dosing in vitro. The sigma-2 recepto...
US Patent US10611728 (2020)