BDBM35545 4-hydroxy-2H-chromen-2-one core, 21
SMILES: Oc1c(Cc2ccccc2)c(=O)oc2c1ccc1ccccc21
InChI Key: InChIKey=LYBYMIBWDFMUQV-UHFFFAOYSA-N
Data: 2 IC50
Activity Spreadsheet -- Enzyme Inhibition Constant Data from BindingDB
Found 2 hits for monomerid = 35545
Trg + Lig
Ki
nM
ΔG°
kcal/mole
IC50
nM
Kd
nM
EC50/IC50
nM
koff
s-1
kon
M-1s-1
pHTemp
°C
NAD(P)H dehydrogenase [quinone] 1
(Homo sapiens (Human))
BDBM35545
(4-hydroxy-2H-chromen-2-one core, 21)
Show SMILES Oc1c(Cc2ccccc2)c(=O)oc2c1ccc1ccccc21
Show InChI InChI=1S/C20H14O3/c21-18-16-11-10-14-8-4-5-9-15(14)19(16)23-20(22)17(18)12-13-6-2-1-3-7-13/h1-11,21H,12H2
Reactome pathway
n/an/a 35n/an/an/an/a7.5n/a
University of Manchester
Assay Description
Recombinant human NQO1 was obtained from Sigma and diluted in 50 mM phosphate buffer to give an absorbance of 0.1 at 550 nm; 5 uL of this solution wa...
J Med Chem 52: 7142-56 (2009)
Article DOI: 10.1021/jm9011609
BindingDB Entry DOI: 10.7270/Q2222S40
NAD(P)H dehydrogenase [quinone] 1
(Homo sapiens (Human))
BDBM35545
(4-hydroxy-2H-chromen-2-one core, 21)
Show SMILES Oc1c(Cc2ccccc2)c(=O)oc2c1ccc1ccccc21
Show InChI InChI=1S/C20H14O3/c21-18-16-11-10-14-8-4-5-9-15(14)19(16)23-20(22)17(18)12-13-6-2-1-3-7-13/h1-11,21H,12H2
Reactome pathway
n/an/a 880n/an/an/an/a7.525
University of Manchester
Assay Description
Recombinant human NQO1 was obtained from Sigma and diluted in 50 mM phosphate buffer to give an absorbance of 0.1 at 550 nm; 5 uL of this solution wa...
J Med Chem 52: 7142-56 (2009)
Article DOI: 10.1021/jm9011609
BindingDB Entry DOI: 10.7270/Q2222S40