BDBM35594 pyrazolo pyrimidine, 27
SMILES: COC(=O)N1CCC(CC1)n1ncc2c(nc(nc12)-c1ccc(NC(=O)Nc2ccc(cc2)N2CCN(C)CC2)cc1)N1CCOCC1
InChI Key: InChIKey=UDRFVTDJBQKEAH-UHFFFAOYSA-N
Data: 4 IC50
Activity Spreadsheet -- Enzyme Inhibition Constant Data from BindingDB
Found 4 hits for monomerid = 35594
Trg + Lig
Ki
nM
ΔG°
kcal/mole
IC50
nM
Kd
nM
EC50/IC50
nM
koff
s-1
kon
M-1s-1
pHTemp
°C
Serine/threonine-protein kinase mTOR
(Homo sapiens (Human))
BDBM35594
(pyrazolo pyrimidine, 27)
Show SMILES COC(=O)N1CCC(CC1)n1ncc2c(nc(nc12)-c1ccc(NC(=O)Nc2ccc(cc2)N2CCN(C)CC2)cc1)N1CCOCC1
Show InChI InChI=1S/C34H42N10O4/c1-40-15-17-41(18-16-40)27-9-7-26(8-10-27)37-33(45)36-25-5-3-24(4-6-25)30-38-31(42-19-21-48-22-20-42)29-23-35-44(32(29)39-30)28-11-13-43(14-12-28)34(46)47-2/h3-10,23,28H,11-22H2,1-2H3,(H2,36,37,45)
NCI pathway
Reactome pathway
n/an/a 0.340n/an/an/an/a7.423
Wyeth Research
Assay Description
The enzyme was assayed in DELFIA format using purified FLAG-TOR in kinase buffer containing ATP and His6-S6K in the presence of inhibitor compounds. ...
J Med Chem 52: 5013-6 (2009)
Article DOI: 10.1021/jm900851f
BindingDB Entry DOI: 10.7270/Q2SJ1HZD
Phosphatidylinositol 4,5-bisphosphate 3-kinase catalytic subunit alpha isoform
(Homo sapiens (Human))
BDBM35594
(pyrazolo pyrimidine, 27)
Show SMILES COC(=O)N1CCC(CC1)n1ncc2c(nc(nc12)-c1ccc(NC(=O)Nc2ccc(cc2)N2CCN(C)CC2)cc1)N1CCOCC1
Show InChI InChI=1S/C34H42N10O4/c1-40-15-17-41(18-16-40)27-9-7-26(8-10-27)37-33(45)36-25-5-3-24(4-6-25)30-38-31(42-19-21-48-22-20-42)29-23-35-44(32(29)39-30)28-11-13-43(14-12-28)34(46)47-2/h3-10,23,28H,11-22H2,1-2H3,(H2,36,37,45)
NCI pathway
Reactome pathway
n/an/a 15n/an/an/an/an/an/a
Wyeth Research
Curated by ChEMBL
Assay Description
Inhibition of PI3Kalpha by DELFIA assay
J Med Chem 52: 8010-24 (2009)
Article DOI: 10.1021/jm9013828
BindingDB Entry DOI: 10.7270/Q28W3DGF
Serine/threonine-protein kinase mTOR
(Homo sapiens (Human))
BDBM35594
(pyrazolo pyrimidine, 27)
Show SMILES COC(=O)N1CCC(CC1)n1ncc2c(nc(nc12)-c1ccc(NC(=O)Nc2ccc(cc2)N2CCN(C)CC2)cc1)N1CCOCC1
Show InChI InChI=1S/C34H42N10O4/c1-40-15-17-41(18-16-40)27-9-7-26(8-10-27)37-33(45)36-25-5-3-24(4-6-25)30-38-31(42-19-21-48-22-20-42)29-23-35-44(32(29)39-30)28-11-13-43(14-12-28)34(46)47-2/h3-10,23,28H,11-22H2,1-2H3,(H2,36,37,45)
NCI pathway
Reactome pathway
n/an/a 0.300n/an/an/an/an/an/a
Wyeth Research
Curated by ChEMBL
Assay Description
Inhibition of human mTOR (1360-2549 amino acids) expressed in HEK293 cells
J Med Chem 52: 8010-24 (2009)
Article DOI: 10.1021/jm9013828
BindingDB Entry DOI: 10.7270/Q28W3DGF
p110α/p85α
(Homo sapiens (Human))
BDBM35594
(pyrazolo pyrimidine, 27)
Show SMILES COC(=O)N1CCC(CC1)n1ncc2c(nc(nc12)-c1ccc(NC(=O)Nc2ccc(cc2)N2CCN(C)CC2)cc1)N1CCOCC1
Show InChI InChI=1S/C34H42N10O4/c1-40-15-17-41(18-16-40)27-9-7-26(8-10-27)37-33(45)36-25-5-3-24(4-6-25)30-38-31(42-19-21-48-22-20-42)29-23-35-44(32(29)39-30)28-11-13-43(14-12-28)34(46)47-2/h3-10,23,28H,11-22H2,1-2H3,(H2,36,37,45)
n/an/a 15n/an/an/an/an/a25
Wyeth Research
Assay Description
Inhibition of PI3K enzyme activity is measured in a microtiter plate-based fluorescence polarization (FP) assay.
J Med Chem 52: 5013-6 (2009)
Article DOI: 10.1021/jm900851f
BindingDB Entry DOI: 10.7270/Q2SJ1HZD