null
SMILES: COCC(=O)NCc1ccc(NC(=O)c2cc(-c3ccn(C)n3)c(cc2F)C(F)(F)F)c(n1)-c1ccccc1
InChI Key: InChIKey=FJSKBZFYMVAPRI-UHFFFAOYSA-N
Activity Spreadsheet -- Enzyme Inhibition Constant Data from BindingDB
Found 1 hit for monomerid = 356058
Trg + Lig
Ki
nM
ΔG°
kcal/mole
IC50
nM
Kd
nM
EC50/IC50
nM
koff
s-1
kon
M-1s-1
pHTemp
°C
High affinity nerve growth factor receptor
(Homo sapiens (Human))
BDBM356058
(2-fluoro-N-(6-((2- methoxyacetamido)methyl)-2- phe...)
Show SMILES COCC(=O)NCc1ccc(NC(=O)c2cc(-c3ccn(C)n3)c(cc2F)C(F)(F)F)c(n1)-c1ccccc1
Show InChI InChI=1S/C27H23F4N5O3/c1-36-11-10-22(35-36)18-12-19(21(28)13-20(18)27(29,30)31)26(38)34-23-9-8-17(14-32-24(37)15-39-2)33-25(23)16-6-4-3-5-7-16/h3-13H,14-15H2,1-2H3,(H,32,37)(H,34,38)
US Patent
n/an/a 0.190n/an/an/an/an/an/a
Merck Sharp & Dohme Corp.
US Patent
Assay Description
TrkA functional activity was measured using a DiscoverX PathHunter assay. In this assay, U2OS cells express the human TrkA receptor as a fusion with ...
US Patent US9815846 (2017)
BindingDB Entry DOI: 10.7270/Q20P129R