BDBM35769 cis-1,2-diaminocyclohexane derivative, 5j
SMILES: CN(C)C(=O)[C@H]1CC[C@H](NC(=O)c2nc3ccc(Cl)cc3c(=O)[nH]2)[C@@H](C1)NC(=O)c1nc2CCN(C)Cc2s1
InChI Key: InChIKey=JXTLYYJGXOUZGB-SOVGHPHASA-N
Data: 1 IC50
Activity Spreadsheet -- Enzyme Inhibition Constant Data from BindingDB
Found 1 hit for monomerid = 35769
Trg + Lig
Ki
nM
ΔG°
kcal/mole
IC50
nM
Kd
nM
EC50/IC50
nM
koff
s-1
kon
M-1s-1
pHTemp
°C
Coagulation factor X
(Homo sapiens (Human))
BDBM35769
(cis-1,2-diaminocyclohexane derivative, 5j)
Show SMILES CN(C)C(=O)[C@H]1CC[C@H](NC(=O)c2nc3ccc(Cl)cc3c(=O)[nH]2)[C@@H](C1)NC(=O)c1nc2CCN(C)Cc2s1 |r|
Show InChI InChI=1S/C26H30ClN7O4S/c1-33(2)26(38)13-4-6-17(29-23(36)21-28-16-7-5-14(27)11-15(16)22(35)32-21)19(10-13)30-24(37)25-31-18-8-9-34(3)12-20(18)39-25/h5,7,11,13,17,19H,4,6,8-10,12H2,1-3H3,(H,29,36)(H,30,37)(H,28,32,35)/t13-,17-,19+/m0/s1
Reactome pathway
n/an/a 1.40n/an/an/an/a7.423
Daiichi Sankyo Co, Ltd
Assay Description
The in vitro anti-fXa activity was measured by using a chromogenic substrate S-2222 and human fXa. Aqueous DMSO or test compounds in aqueous DMSO and...
Bioorg Med Chem 17: 8221-33 (2009)
Article DOI: 10.1016/j.bmc.2009.10.024
BindingDB Entry DOI: 10.7270/Q2CC0Z1V