BDBM36464 3-(4-(3,3-Dimethylbutan-2-ylamino)-6-(3-methylbenzylamino)-1,3,5-triazin-2-ylamino)-N-methoxy-4-methylbenzamide::DEL-A, 4
SMILES: CONC(=O)c1ccc(C)c(Nc2nc(NCc3cccc(C)c3)nc(NC(C)C(C)(C)C)n2)c1
InChI Key: InChIKey=ZHYHFCBQJDBXHS-UHFFFAOYSA-N
Data: 1 IC50
Activity Spreadsheet -- Enzyme Inhibition Constant Data from BindingDB
Found 1 hit for monomerid = 36464
Trg + Lig
Ki
nM
ΔG°
kcal/mole
IC50
nM
Kd
nM
EC50/IC50
nM
koff
s-1
kon
M-1s-1
pHTemp
°C
Mitogen-activated protein kinase 14
(Homo sapiens (Human))
BDBM36464
(3-(4-(3,3-Dimethylbutan-2-ylamino)-6-(3-methylbenz...)
Show SMILES CONC(=O)c1ccc(C)c(Nc2nc(NCc3cccc(C)c3)nc(NC(C)C(C)(C)C)n2)c1
Show InChI InChI=1S/C26H35N7O2/c1-16-9-8-10-19(13-16)15-27-23-30-24(28-18(3)26(4,5)6)32-25(31-23)29-21-14-20(12-11-17(21)2)22(34)33-35-7/h8-14,18H,15H2,1-7H3,(H,33,34)(H3,27,28,29,30,31,32)
NCI pathway
Reactome pathway
n/an/a 15n/an/an/an/a9.516
Praecis Pharmaceuticals
Assay Description
Selection of DNA-encoded libraries (DELs), which are covalent attachment of encoding double stranded DNA to small-molecule created using a combinatio...
Nat Chem Biol 5: 647-54 (2009)
Article DOI: 10.1038/nchembio.211
BindingDB Entry DOI: 10.7270/Q2MP51NX