null
SMILES: CNC(=O)c1cnc2[nH]cc(-c3cccc(CNC(=O)c4cccn(Cc5ccc(F)c(F)c5)c4=O)c3)c2c1
InChI Key: InChIKey=PWRVLLCNHCYCHE-UHFFFAOYSA-N
Activity Spreadsheet -- Enzyme Inhibition Constant Data from BindingDB
Found 1 hit for monomerid = 366314
Trg + Lig
Ki
nM
ΔG°
kcal/mole
IC50
nM
Kd
nM
EC50/IC50
nM
koff
s-1
kon
M-1s-1
pHTemp
°C
3-phosphoinositide-dependent protein kinase 1 [51-360]
(Homo sapiens (Human))
BDBM366314
(US9873693, Compound 239)
Show SMILES CNC(=O)c1cnc2[nH]cc(-c3cccc(CNC(=O)c4cccn(Cc5ccc(F)c(F)c5)c4=O)c3)c2c1
Show InChI InChI=1S/C29H23F2N5O3/c1-32-27(37)20-12-22-23(15-34-26(22)33-14-20)19-5-2-4-17(10-19)13-35-28(38)21-6-3-9-36(29(21)39)16-18-7-8-24(30)25(31)11-18/h2-12,14-15H,13,16H2,1H3,(H,32,37)(H,33,34)(H,35,38)
US Patent
n/an/a<500n/an/an/an/an/an/a
Duquesne University
Assay Description
A PDK1 kinase assay was performed as follows. PDK1 (amino acids 51-360) and AKT2 (amino acids 140-467 fused to PIFtide, amino acids EEQEMFRDFDYIADW) ...
J Med Chem 51: 68-76 (2008)
BindingDB Entry DOI: 10.7270/Q2H41TRT