BDBM37070 4-bromanyl-3,5-dimethyl-1-(2,3,4-trimethylphenyl)sulfonyl-pyrazole::4-bromo-3,5-dimethyl-1-(2,3,4-trimethylphenyl)sulfonyl-pyrazole::4-bromo-3,5-dimethyl-1-(2,3,4-trimethylphenyl)sulfonylpyrazole::4-bromo-3,5-dimethyl-1-[(2,3,4-trimethylphenyl)sulfonyl]-1H-pyrazole::MLS000085543::SMR000020478::cid_3242673
SMILES: Cc1nn(c(C)c1Br)S(=O)(=O)c1ccc(C)c(C)c1C
InChI Key: InChIKey=RIWZECQDJDSSJE-UHFFFAOYSA-N
Data: 3 EC50
Activity Spreadsheet -- Enzyme Inhibition Constant Data from BindingDB
Found 3 hits for monomerid = 37070
Trg + Lig
Ki
nM
ΔG°
kcal/mole
IC50
nM
Kd
nM
EC50/IC50
nM
koff
s-1
kon
M-1s-1
pHTemp
°C
Sphingosine 1-phosphate receptor 1
(Homo sapiens (Human))
BDBM37070
(4-bromanyl-3,5-dimethyl-1-(2,3,4-trimethylphenyl)s...)
Show SMILES Cc1nn(c(C)c1Br)S(=O)(=O)c1ccc(C)c(C)c1C
Show InChI InChI=1S/C14H17BrN2O2S/c1-8-6-7-13(10(3)9(8)2)20(18,19)17-12(5)14(15)11(4)16-17/h6-7H,1-5H3
Reactome pathway
PCBioAssay
n/an/an/an/a 8.31E+4n/an/an/an/a
The Scripps Research Institute Molecular Screening Center
Curated by PubChem BioAssay
Assay Description
Source (MLSCN Center Name): The Scripps Research Institute Molecular Screening Center Center Affiliation: The Scripps Research Institute, TSRI Assay ...
PubChem Bioassay (2007)
BindingDB Entry DOI: 10.7270/Q2ZC817P
Sphingosine 1-phosphate receptor 1
(Homo sapiens (Human))
BDBM37070
(4-bromanyl-3,5-dimethyl-1-(2,3,4-trimethylphenyl)s...)
Show SMILES Cc1nn(c(C)c1Br)S(=O)(=O)c1ccc(C)c(C)c1C
Show InChI InChI=1S/C14H17BrN2O2S/c1-8-6-7-13(10(3)9(8)2)20(18,19)17-12(5)14(15)11(4)16-17/h6-7H,1-5H3
Reactome pathway
PCBioAssay
n/an/an/an/a 8.80E+4n/an/an/an/a
The Scripps Research Institute Molecular Screening Center
Curated by PubChem BioAssay
Assay Description
Source (MLSCN Center Name): The Scripps Research Institute Molecular Screening Center Center Affiliation: The Scripps Research Institute, TSRI Assay ...
PubChem Bioassay (2007)
BindingDB Entry DOI: 10.7270/Q2251GJ9
Sphingosine 1-phosphate receptor 1
(Homo sapiens (Human))
BDBM37070
(4-bromanyl-3,5-dimethyl-1-(2,3,4-trimethylphenyl)s...)
Show SMILES Cc1nn(c(C)c1Br)S(=O)(=O)c1ccc(C)c(C)c1C
Show InChI InChI=1S/C14H17BrN2O2S/c1-8-6-7-13(10(3)9(8)2)20(18,19)17-12(5)14(15)11(4)16-17/h6-7H,1-5H3
Reactome pathway
PCBioAssay
n/an/an/an/a>9.51E+4n/an/an/an/a
The Scripps Research Institute Molecular Screening Center
Curated by PubChem BioAssay
Assay Description
Source (MLSCN Center Name): The Scripps Research Institute Molecular Screening Center Center Affiliation: The Scripps Research Institute, TSRI Assay ...
PubChem Bioassay (2007)
BindingDB Entry DOI: 10.7270/Q25X2795