BDBM389558 N'-{6-bromo-2-[(E)-2-(4- methoxyphenyl)vinyl]quinazolin-4- yl}-N,N-dimethylpropane-1,3- diamine::US9951029, 6
SMILES: COc1ccc(\C=C\c2nc(NCCCN(C)C)c3cc(F)ccc3n2)cc1
InChI Key: InChIKey=VRUUDUAWKZNTBX-KPKJPENVSA-N
Data: 2 IC50
Activity Spreadsheet -- Enzyme Inhibition Constant Data from BindingDB
Found 2 hits for monomerid = 389558
Trg + Lig
Ki
nM
ΔG°
kcal/mole
IC50
nM
Kd
nM
EC50/IC50
nM
koff
s-1
kon
M-1s-1
pHTemp
°C
Receptor-type tyrosine-protein kinase FLT3
(Homo sapiens (Human))
BDBM389558
(N'-{6-bromo-2-[(E)-2-(4- methoxyphenyl)vinyl]quina...)
Show SMILES COc1ccc(\C=C\c2nc(NCCCN(C)C)c3cc(F)ccc3n2)cc1
Show InChI InChI=1S/C22H25FN4O/c1-27(2)14-4-13-24-22-19-15-17(23)8-11-20(19)25-21(26-22)12-7-16-5-9-18(28-3)10-6-16/h5-12,15H,4,13-14H2,1-3H3,(H,24,25,26)/b12-7+
n/an/a 1.35E+3n/an/an/an/an/an/a
Vichem Chemie Research Ltd
Curated by ChEMBL
Assay Description
Inhibition of FLT3 ITD mutant (unknown origin) using TAMRA-Src-tide as substrate measured after 1 hr in presence of ATP at its Km concentration by IM...
Eur J Med Chem 184: (2019)
Article DOI: 10.1016/j.ejmech.2019.111710
Receptor-type tyrosine-protein kinase FLT3
(Homo sapiens (Human))
BDBM389558
(N'-{6-bromo-2-[(E)-2-(4- methoxyphenyl)vinyl]quina...)
Show SMILES COc1ccc(\C=C\c2nc(NCCCN(C)C)c3cc(F)ccc3n2)cc1
Show InChI InChI=1S/C22H25FN4O/c1-27(2)14-4-13-24-22-19-15-17(23)8-11-20(19)25-21(26-22)12-7-16-5-9-18(28-3)10-6-16/h5-12,15H,4,13-14H2,1-3H3,(H,24,25,26)/b12-7+
US Patent
n/an/a 1.42E+3n/an/an/an/an/an/a
Georgia Institute of Technology
Assay Description
FLT3(ITD) biochemical assays were performed on two different assay system platforms, using TranscreenerŽ ADP Assay FP method (BellBrook Labs, Madison...
J Med Chem 52: 456-68 (2009)
BindingDB Entry DOI: 10.7270/Q2NG4T0S