BDBM41608 (4,5-dichloro-6-oxopyridazin-1-yl)methyl 4-fluorobenzoate::4-fluorobenzoic acid (4,5-dichloro-6-keto-pyridazin-1-yl)methyl ester::4-fluorobenzoic acid (4,5-dichloro-6-oxo-1-pyridazinyl)methyl ester::MLS000546963::SMR000180161::[4,5-bis(chloranyl)-6-oxidanylidene-pyridazin-1-yl]methyl 4-fluoranylbenzoate::[4,5-dichloro-6-oxo-1(6H)-pyridazinyl]methyl 4-fluorobenzenecarboxylate::cid_1474462
SMILES: Fc1ccc(cc1)C(=O)OCn1ncc(Cl)c(Cl)c1=O
InChI Key: InChIKey=YIGYFDAHCNYMIX-UHFFFAOYSA-N
Data: 6 IC50  2 EC50
Activity Spreadsheet -- Enzyme Inhibition Constant Data from BindingDB
Found 8 hits for monomerid = 41608
Trg + Lig
Ki
nM
ΔG°
kcal/mole
IC50
nM
Kd
nM
EC50/IC50
nM
koff
s-1
kon
M-1s-1
pHTemp
°C
Sphingosine 1-phosphate receptor 2
(Homo sapiens (Human))
BDBM41608
((4,5-dichloro-6-oxopyridazin-1-yl)methyl 4-fluorob...)
Show SMILES Fc1ccc(cc1)C(=O)OCn1ncc(Cl)c(Cl)c1=O
Show InChI InChI=1S/C12H7Cl2FN2O3/c13-9-5-16-17(11(18)10(9)14)6-20-12(19)7-1-3-8(15)4-2-7/h1-5H,6H2
NCI pathway
Reactome pathway
PCBioAssay
n/an/a 3.77E+3n/an/an/an/an/an/a
The Scripps Research Institute Molecular Screening Center
Curated by PubChem BioAssay
Assay Description
Source (MLSCN Center Name): The Scripps Research Institute Molecular Screening Center Center Affiliation: The Scripps Research Institute (TSRI) Assay...
PubChem Bioassay (2007)
BindingDB Entry DOI: 10.7270/Q2B56H4Q
Sphingosine 1-phosphate receptor 2
(Homo sapiens (Human))
BDBM41608
((4,5-dichloro-6-oxopyridazin-1-yl)methyl 4-fluorob...)
Show SMILES Fc1ccc(cc1)C(=O)OCn1ncc(Cl)c(Cl)c1=O
Show InChI InChI=1S/C12H7Cl2FN2O3/c13-9-5-16-17(11(18)10(9)14)6-20-12(19)7-1-3-8(15)4-2-7/h1-5H,6H2
NCI pathway
Reactome pathway
PCBioAssay
n/an/a 3.81E+3n/an/an/an/an/an/a
The Scripps Research Institute Molecular Screening Center
Curated by PubChem BioAssay
Assay Description
Source (MLSCN Center Name): The Scripps Research Institute Molecular Screening Center Center Affiliation: The Scripps Research Institute (TSRI) Assay...
PubChem Bioassay (2008)
BindingDB Entry DOI: 10.7270/Q2WQ027W
Solute carrier family 12 member 5
(Homo sapiens (Human))
BDBM41608
((4,5-dichloro-6-oxopyridazin-1-yl)methyl 4-fluorob...)
Show SMILES Fc1ccc(cc1)C(=O)OCn1ncc(Cl)c(Cl)c1=O
Show InChI InChI=1S/C12H7Cl2FN2O3/c13-9-5-16-17(11(18)10(9)14)6-20-12(19)7-1-3-8(15)4-2-7/h1-5H,6H2
Reactome pathway
PCBioAssay
n/an/an/an/a 1.41E+4n/an/an/an/a
Vanderbilt Screening Center for GPCRs, Ion Channels and Transporters
Curated by PubChem BioAssay
Assay Description
Vanderbilt Screening Center for GPCRs, Ion Channels and Transporters Assay Provider: Eric Delpire Assay Provider Affliation: Vanderbilt University Gr...
PubChem Bioassay (2009)
BindingDB Entry DOI: 10.7270/Q2TX3CSC
DNA damage-inducible transcript 3 protein
(Mus musculus)
BDBM41608
((4,5-dichloro-6-oxopyridazin-1-yl)methyl 4-fluorob...)
Show SMILES Fc1ccc(cc1)C(=O)OCn1ncc(Cl)c(Cl)c1=O
Show InChI InChI=1S/C12H7Cl2FN2O3/c13-9-5-16-17(11(18)10(9)14)6-20-12(19)7-1-3-8(15)4-2-7/h1-5H,6H2
PCBioAssay
n/an/a 3.14E+3n/an/an/an/an/an/a
Emory University Molecular Libraries Screening Center
Curated by PubChem BioAssay
Assay Description
NIH Molecular Libraries Screening Centers Network [MLSCN] Emory Chemical Biology Discovery Center in MLSCN Assay provider: Dr. Randal Kaufman, Univer...
PubChem Bioassay (2011)
BindingDB Entry DOI: 10.7270/Q28C9TQN
Solute carrier family 12 member 5
(Homo sapiens (Human))
BDBM41608
((4,5-dichloro-6-oxopyridazin-1-yl)methyl 4-fluorob...)
Show SMILES Fc1ccc(cc1)C(=O)OCn1ncc(Cl)c(Cl)c1=O
Show InChI InChI=1S/C12H7Cl2FN2O3/c13-9-5-16-17(11(18)10(9)14)6-20-12(19)7-1-3-8(15)4-2-7/h1-5H,6H2
Reactome pathway
PCBioAssay
n/an/an/an/a 3.32E+3n/an/an/an/a
Vanderbilt Screening Center for GPCRs, Ion Channels and Transporters
Curated by PubChem BioAssay
Assay Description
Vanderbilt Screening Center for GPCRs, Ion Channels and Transporters Assay Provider: Eric Delpire Assay Provider Affliation: Vanderbilt University Gr...
PubChem Bioassay (2009)
BindingDB Entry DOI: 10.7270/Q2M32T6M
DNA damage-inducible transcript 3 protein
(Mus musculus)
BDBM41608
((4,5-dichloro-6-oxopyridazin-1-yl)methyl 4-fluorob...)
Show SMILES Fc1ccc(cc1)C(=O)OCn1ncc(Cl)c(Cl)c1=O
Show InChI InChI=1S/C12H7Cl2FN2O3/c13-9-5-16-17(11(18)10(9)14)6-20-12(19)7-1-3-8(15)4-2-7/h1-5H,6H2
PCBioAssay
n/an/a 3.14E+3n/an/an/an/an/an/a
Emory University Molecular Libraries Screening Center
Curated by PubChem BioAssay
Assay Description
NIH Molecular Libraries Screening Centers Network [MLSCN] Emory Chemical Biology Discovery Center in MLSCN Assay provider: Dr. Randal Kaufman, Univer...
PubChem Bioassay (2010)
BindingDB Entry DOI: 10.7270/Q2PC30VZ
X-box-binding protein 1
(Homo sapiens (Human))
BDBM41608
((4,5-dichloro-6-oxopyridazin-1-yl)methyl 4-fluorob...)
Show SMILES Fc1ccc(cc1)C(=O)OCn1ncc(Cl)c(Cl)c1=O
Show InChI InChI=1S/C12H7Cl2FN2O3/c13-9-5-16-17(11(18)10(9)14)6-20-12(19)7-1-3-8(15)4-2-7/h1-5H,6H2
PCBioAssay
n/an/a 3.93E+3n/an/an/an/an/an/a
Emory University Molecular Libraries Screening Center
Curated by PubChem BioAssay
Assay Description
NIH Molecular Libraries Screening Centers Network [MLSCN] Emory Chemical Biology Discovery Center in MLSCN Assay provider: Dr. Randal Kaufman, Univer...
PubChem Bioassay (2011)
BindingDB Entry DOI: 10.7270/Q2NK3CGB
Tyrosine-protein kinase JAK2
(Homo sapiens (Human))
BDBM41608
((4,5-dichloro-6-oxopyridazin-1-yl)methyl 4-fluorob...)
Show SMILES Fc1ccc(cc1)C(=O)OCn1ncc(Cl)c(Cl)c1=O
Show InChI InChI=1S/C12H7Cl2FN2O3/c13-9-5-16-17(11(18)10(9)14)6-20-12(19)7-1-3-8(15)4-2-7/h1-5H,6H2
Reactome pathway
PCBioAssay
n/an/a 1.14E+3n/an/an/an/an/an/a
The Scripps Research Institute Molecular Screening Center
Curated by PubChem BioAssay
Assay Description
Source (MLPCN Center Name): The Scripps Research Institute Molecular Screening Center (SRIMSC) Center Affiliation: The Scripps Research Institute (TS...
PubChem Bioassay (2009)
BindingDB Entry DOI: 10.7270/Q20863Q9