BDBM44037 3-Nitro-N-(4-pyridin-4-ylmethyl-phenyl)-benzamide::3-nitro-N-[4-(4-pyridylmethyl)phenyl]benzamide::3-nitro-N-[4-(pyridin-4-ylmethyl)phenyl]benzamide::MLS000560891::SMR000175889::cid_823709
SMILES: [O-][N+](=O)c1cccc(c1)C(=O)Nc1ccc(Cc2ccncc2)cc1
InChI Key: InChIKey=ZVLJOTMRVCAENI-UHFFFAOYSA-N
Data: 1 IC50  3 EC50
Activity Spreadsheet -- Enzyme Inhibition Constant Data from BindingDB
Found 4 hits for monomerid = 44037
Trg + Lig
Ki
nM
ΔG°
kcal/mole
IC50
nM
Kd
nM
EC50/IC50
nM
koff
s-1
kon
M-1s-1
pHTemp
°C
electroneutral potassium-chloride cotransporter KCC2
(Homo sapiens (Human))
BDBM44037
(3-Nitro-N-(4-pyridin-4-ylmethyl-phenyl)-benzamide ...)
Show SMILES [O-][N+](=O)c1cccc(c1)C(=O)Nc1ccc(Cc2ccncc2)cc1
Show InChI InChI=1S/C19H15N3O3/c23-19(16-2-1-3-18(13-16)22(24)25)21-17-6-4-14(5-7-17)12-15-8-10-20-11-9-15/h1-11,13H,12H2,(H,21,23)
Reactome pathway
PCBioAssay
n/an/an/an/a 9.28E+3n/an/an/an/a
Vanderbilt Screening Center for GPCRs, Ion Channels and Transporters
Curated by PubChem BioAssay
Assay Description
Vanderbilt Screening Center for GPCRs, Ion Channels and Transporters Assay Provider: Eric Delpire Assay Provider Affliation: Vanderbilt University Gr...
PubChem Bioassay (2009)
BindingDB Entry DOI: 10.7270/Q2Q52N1X
nuclear receptor subfamily 5 group A member 2 isoform 2
(Homo sapiens (Human))
BDBM44037
(3-Nitro-N-(4-pyridin-4-ylmethyl-phenyl)-benzamide ...)
Show SMILES [O-][N+](=O)c1cccc(c1)C(=O)Nc1ccc(Cc2ccncc2)cc1
Show InChI InChI=1S/C19H15N3O3/c23-19(16-2-1-3-18(13-16)22(24)25)21-17-6-4-14(5-7-17)12-15-8-10-20-11-9-15/h1-11,13H,12H2,(H,21,23)
Reactome pathway
PCBioAssay
n/an/a>3.59E+4n/an/an/an/an/an/a
The Scripps Research Institute Molecular Screening Center
Curated by PubChem BioAssay
PubChem Bioassay (2013)
BindingDB Entry DOI: 10.7270/Q22F7M18
electroneutral potassium-chloride cotransporter KCC2
(Homo sapiens (Human))
BDBM44037
(3-Nitro-N-(4-pyridin-4-ylmethyl-phenyl)-benzamide ...)
Show SMILES [O-][N+](=O)c1cccc(c1)C(=O)Nc1ccc(Cc2ccncc2)cc1
Show InChI InChI=1S/C19H15N3O3/c23-19(16-2-1-3-18(13-16)22(24)25)21-17-6-4-14(5-7-17)12-15-8-10-20-11-9-15/h1-11,13H,12H2,(H,21,23)
Reactome pathway
PCBioAssay
n/an/an/an/a 4.96E+3n/an/an/an/a
Vanderbilt Screening Center for GPCRs, Ion Channels and Transporters
Curated by PubChem BioAssay
Assay Description
Vanderbilt Screening Center for GPCRs, Ion Channels and Transporters Assay Provider: Eric Delpire Assay Provider Affliation: Vanderbilt University Gr...
PubChem Bioassay (2009)
BindingDB Entry DOI: 10.7270/Q2M32T6M
electroneutral potassium-chloride cotransporter KCC2
(Homo sapiens (Human))
BDBM44037
(3-Nitro-N-(4-pyridin-4-ylmethyl-phenyl)-benzamide ...)
Show SMILES [O-][N+](=O)c1cccc(c1)C(=O)Nc1ccc(Cc2ccncc2)cc1
Show InChI InChI=1S/C19H15N3O3/c23-19(16-2-1-3-18(13-16)22(24)25)21-17-6-4-14(5-7-17)12-15-8-10-20-11-9-15/h1-11,13H,12H2,(H,21,23)
Reactome pathway
PCBioAssay
n/an/an/an/a 1.53E+4n/an/an/an/a
Vanderbilt Screening Center for GPCRs, Ion Channels and Transporters
Curated by PubChem BioAssay
Assay Description
Vanderbilt Screening Center for GPCRs, Ion Channels and Transporters Assay Provider: Eric Delpire Assay Provider Affliation: Vanderbilt University Gr...
PubChem Bioassay (2009)
BindingDB Entry DOI: 10.7270/Q2TX3CSC