BDBM50001254 1-(8-Methoxy-4-o-tolylamino-quinolin-3-yl)-butan-1-one::CHEMBL327717::SK&F-96067::SK-96067
SMILES: CCCC(=O)c1cnc2c(OC)cccc2c1Nc1ccccc1C
InChI Key: InChIKey=MAVJDLHBPIXVJL-UHFFFAOYSA-N
Data: 3 IC50
Activity Spreadsheet -- Enzyme Inhibition Constant Data from BindingDB
Found 3 hits for monomerid = 50001254
Trg + Lig
Ki
nM
ΔG°
kcal/mole
IC50
nM
Kd
nM
EC50/IC50
nM
koff
s-1
kon
M-1s-1
pHTemp
°C
Potassium-transporting ATPase
(Sus scrofa (Pig))
BDBM50001254
(1-(8-Methoxy-4-o-tolylamino-quinolin-3-yl)-butan-1...)
Show SMILES CCCC(=O)c1cnc2c(OC)cccc2c1Nc1ccccc1C
Show InChI InChI=1S/C21H22N2O2/c1-4-8-18(24)16-13-22-21-15(10-7-12-19(21)25-3)20(16)23-17-11-6-5-9-14(17)2/h5-7,9-13H,4,8H2,1-3H3,(H,22,23)
n/an/a 1.70E+3n/an/an/an/a7.0n/a
SmithKline Beecham Pharmaceuticals R&D
Curated by ChEMBL
Assay Description
Inhibition of K+ -stimulated gastric ATPase activity was measured using lyophilized gastric vesicles at pH 7
J Med Chem 38: 2748-62 (1995)
BindingDB Entry DOI: 10.7270/Q2ZK5FPD
Potassium-transporting ATPase alpha chain 1/beta chain
(Homo sapiens (Human))
BDBM50001254
(1-(8-Methoxy-4-o-tolylamino-quinolin-3-yl)-butan-1...)
Show SMILES CCCC(=O)c1cnc2c(OC)cccc2c1Nc1ccccc1C
Show InChI InChI=1S/C21H22N2O2/c1-4-8-18(24)16-13-22-21-15(10-7-12-19(21)25-3)20(16)23-17-11-6-5-9-14(17)2/h5-7,9-13H,4,8H2,1-3H3,(H,22,23)
n/an/a 1.80E+4n/an/an/an/an/an/a
Korea Research Institute of Chemical Technology
Curated by ChEMBL
Assay Description
Compound was tested in vitro for H+/K+ ATPase activity in rabbit stomach preparations
Bioorg Med Chem Lett 9: 2819-22 (1999)
BindingDB Entry DOI: 10.7270/Q2T72GM3
Potassium-transporting ATPase
(Sus scrofa (Pig))
BDBM50001254
(1-(8-Methoxy-4-o-tolylamino-quinolin-3-yl)-butan-1...)
Show SMILES CCCC(=O)c1cnc2c(OC)cccc2c1Nc1ccccc1C
Show InChI InChI=1S/C21H22N2O2/c1-4-8-18(24)16-13-22-21-15(10-7-12-19(21)25-3)20(16)23-17-11-6-5-9-14(17)2/h5-7,9-13H,4,8H2,1-3H3,(H,22,23)
n/an/a 1.05E+3n/an/an/an/an/an/a
SmithKline Beecham Pharmaceuticals R&D
Curated by ChEMBL
Assay Description
Concentration required to inhibit the activity of K+ stimulated gastric ATPase
J Med Chem 35: 3413-22 (1992)
BindingDB Entry DOI: 10.7270/Q2CN74J2