null
SMILES: COCCOc1cc2ncnc(NC3=CC(=O)C(OC(CF)CF)=C(Cl)C3=O)c2cc1OC
InChI Key: InChIKey=GVKMWIQIPNJGDT-UHFFFAOYSA-N
Activity Spreadsheet -- Enzyme Inhibition Constant Data from BindingDB
Found 4 hits for monomerid = 50002445
Trg + Lig
Ki
nM
ΔG°
kcal/mole
IC50
nM
Kd
nM
EC50/IC50
nM
koff
s-1
kon
M-1s-1
pHTemp
°C
Vascular endothelial growth factor receptor 2
(Homo sapiens (Human))
BDBM50002445
(CHEMBL2113171)
Show SMILES COCCOc1cc2ncnc(NC3=CC(=O)C(OC(CF)CF)=C(Cl)C3=O)c2cc1OC |t:13,23|
Show InChI InChI=1S/C21H20ClF2N3O6/c1-30-3-4-32-17-7-13-12(5-16(17)31-2)21(26-10-25-13)27-14-6-15(28)20(18(22)19(14)29)33-11(8-23)9-24/h5-7,10-11H,3-4,8-9H2,1-2H3,(H,25,26,27)
NCI pathway
Reactome pathway
n/an/a 3n/an/an/an/an/an/a
Wyeth Research
Curated by ChEMBL
Assay Description
Inhibition of poly(Glu4-Tyr)peptide phosphorylation by recombinant VEGFR2 at 10 uM ATP and in presence of 5% mouse plasma
J Med Chem 48: 7560-81 (2005)
Article DOI: 10.1021/jm050559f
BindingDB Entry DOI: 10.7270/Q2028R3S
Vascular endothelial growth factor receptor 2
(Homo sapiens (Human))
BDBM50002445
(CHEMBL2113171)
Show SMILES COCCOc1cc2ncnc(NC3=CC(=O)C(OC(CF)CF)=C(Cl)C3=O)c2cc1OC |t:13,23|
Show InChI InChI=1S/C21H20ClF2N3O6/c1-30-3-4-32-17-7-13-12(5-16(17)31-2)21(26-10-25-13)27-14-6-15(28)20(18(22)19(14)29)33-11(8-23)9-24/h5-7,10-11H,3-4,8-9H2,1-2H3,(H,25,26,27)
NCI pathway
Reactome pathway
n/an/a 792n/an/an/an/an/an/a
Wyeth Research
Curated by ChEMBL
Assay Description
Inhibitory activity against VEGF stimulated autophosphorylation of VEGFR2 expressed in KDR15 cells
J Med Chem 48: 7560-81 (2005)
Article DOI: 10.1021/jm050559f
BindingDB Entry DOI: 10.7270/Q2028R3S
Vascular endothelial growth factor receptor 2
(Homo sapiens (Human))
BDBM50002445
(CHEMBL2113171)
Show SMILES COCCOc1cc2ncnc(NC3=CC(=O)C(OC(CF)CF)=C(Cl)C3=O)c2cc1OC |t:13,23|
Show InChI InChI=1S/C21H20ClF2N3O6/c1-30-3-4-32-17-7-13-12(5-16(17)31-2)21(26-10-25-13)27-14-6-15(28)20(18(22)19(14)29)33-11(8-23)9-24/h5-7,10-11H,3-4,8-9H2,1-2H3,(H,25,26,27)
NCI pathway
Reactome pathway
n/an/a 71n/an/an/an/an/an/a
Wyeth Research
Curated by ChEMBL
Assay Description
Inhibition of poly(Glu4-Tyr)peptide phosphorylation by recombinant VEGFR2 at 10 uM ATP and in presence of 100 uM glutathione
J Med Chem 48: 7560-81 (2005)
Article DOI: 10.1021/jm050559f
BindingDB Entry DOI: 10.7270/Q2028R3S
Vascular endothelial growth factor receptor 2
(Homo sapiens (Human))
BDBM50002445
(CHEMBL2113171)
Show SMILES COCCOc1cc2ncnc(NC3=CC(=O)C(OC(CF)CF)=C(Cl)C3=O)c2cc1OC |t:13,23|
Show InChI InChI=1S/C21H20ClF2N3O6/c1-30-3-4-32-17-7-13-12(5-16(17)31-2)21(26-10-25-13)27-14-6-15(28)20(18(22)19(14)29)33-11(8-23)9-24/h5-7,10-11H,3-4,8-9H2,1-2H3,(H,25,26,27)
NCI pathway
Reactome pathway
n/an/a 0.400n/an/an/an/an/an/a
Wyeth Research
Curated by ChEMBL
Assay Description
Inhibition of poly(Glu4-Tyr)peptide phosphorylation by recombinant VEGFR2 at 10 uM ATP
J Med Chem 48: 7560-81 (2005)
Article DOI: 10.1021/jm050559f
BindingDB Entry DOI: 10.7270/Q2028R3S