BDBM50005904 1,6,8-Trihydroxy-2-methyl-anthraquinone::CHEMBL38674
SMILES: Cc1ccc2C(=O)c3cc(O)cc(O)c3C(=O)c2c1O
InChI Key: InChIKey=WWWXHYLOWHBTBQ-UHFFFAOYSA-N
Data: 1 IC50
Activity Spreadsheet -- Enzyme Inhibition Constant Data from BindingDB
Found 1 hit for monomerid = 50005904
Trg + Lig
Ki
nM
ΔG°
kcal/mole
IC50
nM
Kd
nM
EC50/IC50
nM
koff
s-1
kon
M-1s-1
pHTemp
°C
Leukocyte elastase
(Homo sapiens (Human))
BDBM50005904
(1,6,8-Trihydroxy-2-methyl-anthraquinone | CHEMBL38...)
Show SMILES Cc1ccc2C(=O)c3cc(O)cc(O)c3C(=O)c2c1O
Show InChI InChI=1S/C15H10O5/c1-6-2-3-8-12(13(6)18)15(20)11-9(14(8)19)4-7(16)5-10(11)17/h2-5,16-18H,1H3
Reactome pathway
n/an/a 2.10E+4n/an/an/an/an/an/a
School of Chemistry and Biochemistry
Curated by ChEMBL
Assay Description
Compound was tested for the enzyme inhibitory activity against Human Leukocyte Elastase (HLE) at 55 uM concentration
J Med Chem 35: 1597-605 (1992)
BindingDB Entry DOI: 10.7270/Q2QN67D7