BDBM50006635 CHEMBL3235511
SMILES: COc1cc2C3CCCN3CCc2cc1O
InChI Key: InChIKey=UPVYRZXWGMSCFU-UHFFFAOYSA-N
Data: 3 KI  2 IC50
Activity Spreadsheet -- Enzyme Inhibition Constant Data from BindingDB
Found 5 hits for monomerid = 50006635
Trg + Lig
Ki
nM
ΔG°
kcal/mole
IC50
nM
Kd
nM
EC50/IC50
nM
koff
s-1
kon
M-1s-1
pHTemp
°C
Neuronal acetylcholine receptor protein alpha-4/beta-2 subunit
(Rattus norvegicus (Rat))
BDBM50006635
(CHEMBL3235511)
Show SMILES COc1cc2C3CCCN3CCc2cc1O
Show InChI InChI=1S/C13H17NO2/c1-16-13-8-10-9(7-12(13)15)4-6-14-5-2-3-11(10)14/h7-8,11,15H,2-6H2,1H3
1.00E+5n/an/an/an/an/an/an/an/a
University of Copenhagen
Curated by ChEMBL
Assay Description
Displacement of [3H]epibatidine from rat alpha4/beta2 nAChR expressed in HEK293 cells
J Med Chem 56: 9673-82 (2014)
Article DOI: 10.1021/jm4013592
BindingDB Entry DOI: 10.7270/Q2JS9RZK
Neuronal acetylcholine receptor protein alpha-4/beta-4 subunit
(Rattus norvegicus (Rat))
BDBM50006635
(CHEMBL3235511)
Show SMILES COc1cc2C3CCCN3CCc2cc1O
Show InChI InChI=1S/C13H17NO2/c1-16-13-8-10-9(7-12(13)15)4-6-14-5-2-3-11(10)14/h7-8,11,15H,2-6H2,1H3
1.00E+5n/an/an/an/an/an/an/an/a
University of Copenhagen
Curated by ChEMBL
Assay Description
Displacement of [3H]epibatidine from rat alpha4/beta4 nAChR expressed in HEK293 cells
J Med Chem 56: 9673-82 (2014)
Article DOI: 10.1021/jm4013592
BindingDB Entry DOI: 10.7270/Q2JS9RZK
Neuronal acetylcholine receptor Alpha-3/Beta-4
(Rattus norvegicus (Rat))
BDBM50006635
(CHEMBL3235511)
Show SMILES COc1cc2C3CCCN3CCc2cc1O
Show InChI InChI=1S/C13H17NO2/c1-16-13-8-10-9(7-12(13)15)4-6-14-5-2-3-11(10)14/h7-8,11,15H,2-6H2,1H3
NCI pathway
Reactome pathway
3.00E+5n/an/an/an/an/an/an/an/a
University of Copenhagen
Curated by ChEMBL
Assay Description
Displacement of [3H]epibatidine from rat alpha3/beta4 nAChR expressed in HEK293 cells
J Med Chem 56: 9673-82 (2014)
Article DOI: 10.1021/jm4013592
BindingDB Entry DOI: 10.7270/Q2JS9RZK
Neuronal acetylcholine receptor subunit beta-2
(Mus musculus)
BDBM50006635
(CHEMBL3235511)
Show SMILES COc1cc2C3CCCN3CCc2cc1O
Show InChI InChI=1S/C13H17NO2/c1-16-13-8-10-9(7-12(13)15)4-6-14-5-2-3-11(10)14/h7-8,11,15H,2-6H2,1H3
n/an/a 5.00E+4n/an/an/an/an/an/a
University of Copenhagen
Curated by ChEMBL
Assay Description
Antagonist activity at mouse alpha4/beta2 nAChR expressed in HEK293 cells assessed as inhibition of (S)-nicotine-induced activity by FLIPR membrane p...
J Med Chem 56: 9673-82 (2014)
Article DOI: 10.1021/jm4013592
BindingDB Entry DOI: 10.7270/Q2JS9RZK
Neuronal acetylcholine receptor Alpha-3/Beta-4
(Rattus norvegicus (Rat))
BDBM50006635
(CHEMBL3235511)
Show SMILES COc1cc2C3CCCN3CCc2cc1O
Show InChI InChI=1S/C13H17NO2/c1-16-13-8-10-9(7-12(13)15)4-6-14-5-2-3-11(10)14/h7-8,11,15H,2-6H2,1H3
NCI pathway
Reactome pathway
n/an/a 3.00E+5n/an/an/an/an/an/a
University of Copenhagen
Curated by ChEMBL
Assay Description
Antagonist activity at rat alpha3/beta4 nAChR expressed in HEK293 cells assessed as inhibition of (S)-nicotine-induced activity by FLIPR membrane pot...
J Med Chem 56: 9673-82 (2014)
Article DOI: 10.1021/jm4013592
BindingDB Entry DOI: 10.7270/Q2JS9RZK