BDBM50006998 2-(3,4-Dichloro-phenyl)-N-methyl-N-(3-pyrrolidin-1-yl-1,2,3,4-tetrahydro-anthracen-2-yl)-acetamide::CHEMBL55244
SMILES: CN([C@@H]1Cc2cc3ccccc3cc2C[C@H]1N1CCCC1)C(=O)Cc1ccc(Cl)c(Cl)c1
InChI Key: InChIKey=QZPVBDWKSMUGSH-CLJLJLNGSA-N
Data: 1 KI  1 IC50
Activity Spreadsheet -- Enzyme Inhibition Constant Data from BindingDB
Found 2 hits for monomerid = 50006998
Trg + Lig
Ki
nM
ΔG°
kcal/mole
IC50
nM
Kd
nM
EC50/IC50
nM
koff
s-1
kon
M-1s-1
pHTemp
°C
Mu-type opioid receptor
(MOUSE)
BDBM50006998
(2-(3,4-Dichloro-phenyl)-N-methyl-N-(3-pyrrolidin-1...)
Show SMILES CN([C@@H]1Cc2cc3ccccc3cc2C[C@H]1N1CCCC1)C(=O)Cc1ccc(Cl)c(Cl)c1
Show InChI InChI=1S/C27H28Cl2N2O/c1-30(27(32)13-18-8-9-23(28)24(29)12-18)25-16-21-14-19-6-2-3-7-20(19)15-22(21)17-26(25)31-10-4-5-11-31/h2-3,6-9,12,14-15,25-26H,4-5,10-11,13,16-17H2,1H3/t25-,26-/m1/s1
Reactome pathway
>1.00E+3n/an/an/an/an/an/an/an/a
University of Notre Dame
Curated by ChEMBL
Assay Description
Binding affinity against opioid receptor mu using [3H]-etorphine as a radioligand
J Med Chem 34: 1891-6 (1991)
BindingDB Entry DOI: 10.7270/Q2WW7GM5
Kappa-type opioid receptor
(Mus musculus (Mouse))
BDBM50006998
(2-(3,4-Dichloro-phenyl)-N-methyl-N-(3-pyrrolidin-1...)
Show SMILES CN([C@@H]1Cc2cc3ccccc3cc2C[C@H]1N1CCCC1)C(=O)Cc1ccc(Cl)c(Cl)c1
Show InChI InChI=1S/C27H28Cl2N2O/c1-30(27(32)13-18-8-9-23(28)24(29)12-18)25-16-21-14-19-6-2-3-7-20(19)15-22(21)17-26(25)31-10-4-5-11-31/h2-3,6-9,12,14-15,25-26H,4-5,10-11,13,16-17H2,1H3/t25-,26-/m1/s1
n/an/a 145n/an/an/an/an/an/a
University of Notre Dame
Curated by ChEMBL
Assay Description
Binding affinity against opioid receptor kappa using [3H]U-69,593 as a radioligand
J Med Chem 34: 1891-6 (1991)
BindingDB Entry DOI: 10.7270/Q2WW7GM5