BDBM50008564 1-Fluoro-3-methyl-benzene::CHEMBL345698
SMILES: Cc1cccc(F)c1
InChI Key: InChIKey=BTQZKHUEUDPRST-UHFFFAOYSA-N
Data: 2 IC50
Activity Spreadsheet -- Enzyme Inhibition Constant Data from BindingDB
Found 2 hits for monomerid = 50008564
Trg + Lig
Ki
nM
ΔG°
kcal/mole
IC50
nM
Kd
nM
EC50/IC50
nM
koff
s-1
kon
M-1s-1
pHTemp
°C
Acetylcholinesterase
(Homo sapiens (Human))
BDBM50008564
(1-Fluoro-3-methyl-benzene | CHEMBL345698)
Show SMILES Cc1cccc(F)c1
Show InChI InChI=1S/C7H7F/c1-6-3-2-4-7(8)5-6/h2-5H,1H3
NCI pathway
Reactome pathway
n/an/a 1n/an/an/an/an/an/a
University of Illinois
Curated by ChEMBL
Assay Description
Inhibition of acetylcholinesterase.
J Med Chem 35: 584-9 (1992)
BindingDB Entry DOI: 10.7270/Q20G3J3J
Acetylcholinesterase
(Homo sapiens (Human))
BDBM50008564
(1-Fluoro-3-methyl-benzene | CHEMBL345698)
Show SMILES Cc1cccc(F)c1
Show InChI InChI=1S/C7H7F/c1-6-3-2-4-7(8)5-6/h2-5H,1H3
NCI pathway
Reactome pathway
n/an/a 4.90E+3n/an/an/an/an/an/a
University of Illinois
Curated by ChEMBL
Assay Description
IC50 against acetylcholinesterase; value ranges from 1-4900 nM.
J Med Chem 35: 584-9 (1992)
BindingDB Entry DOI: 10.7270/Q20G3J3J