null
SMILES: OC(=O)Cc1nn(Cc2nc3cc(Cl)ccc3s2)c(=O)c2ccccc12
InChI Key: InChIKey=LNCWRJYGGOAOMU-UHFFFAOYSA-N
Activity Spreadsheet -- Enzyme Inhibition Constant Data from BindingDB
Found 1 hit for monomerid = 50009829
Trg + Lig
Ki
nM
ΔG°
kcal/mole
IC50
nM
Kd
nM
EC50/IC50
nM
koff
s-1
kon
M-1s-1
pHTemp
°C
Aldo-keto reductase family 1 member B1
(Homo sapiens (Human))
BDBM50009829
(CHEMBL20197 | [3-(5-Chloro-benzothiazol-2-ylmethyl...)
Show SMILES OC(=O)Cc1nn(Cc2nc3cc(Cl)ccc3s2)c(=O)c2ccccc12
Show InChI InChI=1S/C18H12ClN3O3S/c19-10-5-6-15-14(7-10)20-16(26-15)9-22-18(25)12-4-2-1-3-11(12)13(21-22)8-17(23)24/h1-7H,8-9H2,(H,23,24)
n/an/a 7.10n/an/an/an/an/an/a
Pfizer Inc.
Curated by ChEMBL
Assay Description
Inhibition of aldose reductase (aldo-keto reductase, AKR1B1) isolated from human placenta.
J Med Chem 34: 108-22 (1991)
BindingDB Entry DOI: 10.7270/Q2513X6H