BDBM50009945 4-Methoxymethyl-1-phenyl-1H-pyrazol-3-ol::CHEMBL416067
SMILES: COCc1cn([nH]c1=O)-c1ccccc1
InChI Key: InChIKey=QRQVBVHKLZWFNU-UHFFFAOYSA-N
Data: 1 IC50
Activity Spreadsheet -- Enzyme Inhibition Constant Data from BindingDB
Found 1 hit for monomerid = 50009945
Trg + Lig
Ki
nM
ΔG°
kcal/mole
IC50
nM
Kd
nM
EC50/IC50
nM
koff
s-1
kon
M-1s-1
pHTemp
°C
Arachidonate 5-lipoxygenase
(Rattus norvegicus)
BDBM50009945
(4-Methoxymethyl-1-phenyl-1H-pyrazol-3-ol | CHEMBL4...)
Show SMILES COCc1cn([nH]c1=O)-c1ccccc1
Show InChI InChI=1S/C11H12N2O2/c1-15-8-9-7-13(12-11(9)14)10-5-3-2-4-6-10/h2-7H,8H2,1H3,(H,12,14)
n/an/a>1.00E+3n/an/an/an/an/an/a
Sterling Research Group
Curated by ChEMBL
Assay Description
In vitro inhibition of rat 5-Lipoxygenase
J Med Chem 34: 1560-70 (1991)
BindingDB Entry DOI: 10.7270/Q2RV0MPG