BDBM50010033 2-[3-(4-Benzo[d]isoxazol-3-yl-piperazin-1-yl)-propyl]-2H-naphtho[1,8-cd]isothiazole 1,1-dioxide::CHEMBL418911
SMILES: O=S1(=O)N(CCCN2CCN(CC2)c2noc3ccccc23)c2cccc3cccc1c23
InChI Key: InChIKey=DAWLQXVXJZJFFV-UHFFFAOYSA-N
Data: 3 IC50
Activity Spreadsheet -- Enzyme Inhibition Constant Data from BindingDB
Found 3 hits for monomerid = 50010033
Trg + Lig
Ki
nM
ΔG°
kcal/mole
IC50
nM
Kd
nM
EC50/IC50
nM
koff
s-1
kon
M-1s-1
pHTemp
°C
D(2) dopamine receptor
(Rattus norvegicus (rat))
BDBM50010033
(2-[3-(4-Benzo[d]isoxazol-3-yl-piperazin-1-yl)-prop...)
Show SMILES O=S1(=O)N(CCCN2CCN(CC2)c2noc3ccccc23)c2cccc3cccc1c23
Show InChI InChI=1S/C24H24N4O3S/c29-32(30)22-11-4-7-18-6-3-9-20(23(18)22)28(32)13-5-12-26-14-16-27(17-15-26)24-19-8-1-2-10-21(19)31-25-24/h1-4,6-11H,5,12-17H2
Reactome pathway
n/an/a 990n/an/an/an/an/an/a
Centre de Recherches de Vitry Alfortville Rh£ne-Poulenc Rorer
Curated by ChEMBL
Assay Description
The concentration required to inhibit [3H]spiperone binding to dopamine receptor D2 in rat brain membranes (in vitro)
J Med Chem 34: 2477-83 (1991)
BindingDB Entry DOI: 10.7270/Q2R78FT1
Alpha-1 Adrenergic Receptor/ adrenergic receptor/ adrenergic receptor
(Rattus norvegicus (rat)-Rattus norvegicus (Rat))
BDBM50010033
(2-[3-(4-Benzo[d]isoxazol-3-yl-piperazin-1-yl)-prop...)
Show SMILES O=S1(=O)N(CCCN2CCN(CC2)c2noc3ccccc23)c2cccc3cccc1c23
Show InChI InChI=1S/C24H24N4O3S/c29-32(30)22-11-4-7-18-6-3-9-20(23(18)22)28(32)13-5-12-26-14-16-27(17-15-26)24-19-8-1-2-10-21(19)31-25-24/h1-4,6-11H,5,12-17H2
Reactome pathway
n/an/a 144n/an/an/an/an/an/a
Centre de Recherches de Vitry Alfortville Rh£ne-Poulenc Rorer
Curated by ChEMBL
Assay Description
The concentration required to inhibit [3H]prazosin binding to Alpha-1 adrenergic receptor in rat brain membranes was measured (in vitro)
J Med Chem 34: 2477-83 (1991)
BindingDB Entry DOI: 10.7270/Q2R78FT1
Serotonin 2 (5-HT2) receptor
(Rattus norvegicus (rat)-RAT-Rattus norvegicus (Rat...)
BDBM50010033
(2-[3-(4-Benzo[d]isoxazol-3-yl-piperazin-1-yl)-prop...)
Show SMILES O=S1(=O)N(CCCN2CCN(CC2)c2noc3ccccc23)c2cccc3cccc1c23
Show InChI InChI=1S/C24H24N4O3S/c29-32(30)22-11-4-7-18-6-3-9-20(23(18)22)28(32)13-5-12-26-14-16-27(17-15-26)24-19-8-1-2-10-21(19)31-25-24/h1-4,6-11H,5,12-17H2
n/an/a 2.30n/an/an/an/an/an/a
Centre de Recherches de Vitry Alfortville Rh£ne-Poulenc Rorer
Curated by ChEMBL
Assay Description
The concentration required to inhibit [3H]ketanserin binding to 5-hydroxytryptamine 2 receptor in rat brain membranes (in vitro)
J Med Chem 34: 2477-83 (1991)
BindingDB Entry DOI: 10.7270/Q2R78FT1