BDBM50010042 2-{3-[4-(4-Chloro-phenyl)-piperazin-1-yl]-propyl}-2H-naphtho[1,8-cd]isothiazole 1,1-dioxide::CHEMBL83035
SMILES: Clc1ccc(cc1)N1CCN(CCCN2c3cccc4cccc(c34)S2(=O)=O)CC1
InChI Key: InChIKey=CJJCHMQYAVQPOO-UHFFFAOYSA-N
Data: 2 KI  3 IC50
Activity Spreadsheet -- Enzyme Inhibition Constant Data from BindingDB
Found 5 hits for monomerid = 50010042
Trg + Lig
Ki
nM
ΔG°
kcal/mole
IC50
nM
Kd
nM
EC50/IC50
nM
koff
s-1
kon
M-1s-1
pHTemp
°C
5-hydroxytryptamine receptor 2A
(Rattus norvegicus (rat))
BDBM50010042
(2-{3-[4-(4-Chloro-phenyl)-piperazin-1-yl]-propyl}-...)
Show SMILES Clc1ccc(cc1)N1CCN(CCCN2c3cccc4cccc(c34)S2(=O)=O)CC1
Show InChI InChI=1S/C23H24ClN3O2S/c24-19-8-10-20(11-9-19)26-16-14-25(15-17-26)12-3-13-27-21-6-1-4-18-5-2-7-22(23(18)21)30(27,28)29/h1-2,4-11H,3,12-17H2
Reactome pathway
5n/an/an/an/an/an/an/an/a
Cracow University of Technology
Curated by ChEMBL
Assay Description
Displacement of [3H]ketanserin from 5HT2A receptor in rat cortical membranes incubated for 15 mins by liquid scintillation spectrometry
Bioorg Med Chem 27: 3396-3407 (2019)
Article DOI: 10.1016/j.bmc.2019.06.028
D(2) dopamine receptor
(Rattus norvegicus (rat))
BDBM50010042
(2-{3-[4-(4-Chloro-phenyl)-piperazin-1-yl]-propyl}-...)
Show SMILES Clc1ccc(cc1)N1CCN(CCCN2c3cccc4cccc(c34)S2(=O)=O)CC1
Show InChI InChI=1S/C23H24ClN3O2S/c24-19-8-10-20(11-9-19)26-16-14-25(15-17-26)12-3-13-27-21-6-1-4-18-5-2-7-22(23(18)21)30(27,28)29/h1-2,4-11H,3,12-17H2
Reactome pathway
>1.00E+3n/an/an/an/an/an/an/an/a
Cracow University of Technology
Curated by ChEMBL
Assay Description
Displacement of [3H]spiperone from dopamine D2 receptor in Sprague-Dawley rat striatal membranes incubated for 40 mins
Bioorg Med Chem 27: 3396-3407 (2019)
Article DOI: 10.1016/j.bmc.2019.06.028
Serotonin 2 (5-HT2) receptor
(Rattus norvegicus (rat)-RAT-Rattus norvegicus (Rat...)
BDBM50010042
(2-{3-[4-(4-Chloro-phenyl)-piperazin-1-yl]-propyl}-...)
Show SMILES Clc1ccc(cc1)N1CCN(CCCN2c3cccc4cccc(c34)S2(=O)=O)CC1
Show InChI InChI=1S/C23H24ClN3O2S/c24-19-8-10-20(11-9-19)26-16-14-25(15-17-26)12-3-13-27-21-6-1-4-18-5-2-7-22(23(18)21)30(27,28)29/h1-2,4-11H,3,12-17H2
n/an/a 5n/an/an/an/an/an/a
Centre de Recherches de Vitry Alfortville Rh£ne-Poulenc Rorer
Curated by ChEMBL
Assay Description
The concentration required to inhibit [3H]ketanserin binding to 5-hydroxytryptamine 2 receptor in rat brain membranes (in vitro)
J Med Chem 34: 2477-83 (1991)
BindingDB Entry DOI: 10.7270/Q2R78FT1
D(2) dopamine receptor
(Rattus norvegicus (rat))
BDBM50010042
(2-{3-[4-(4-Chloro-phenyl)-piperazin-1-yl]-propyl}-...)
Show SMILES Clc1ccc(cc1)N1CCN(CCCN2c3cccc4cccc(c34)S2(=O)=O)CC1
Show InChI InChI=1S/C23H24ClN3O2S/c24-19-8-10-20(11-9-19)26-16-14-25(15-17-26)12-3-13-27-21-6-1-4-18-5-2-7-22(23(18)21)30(27,28)29/h1-2,4-11H,3,12-17H2
Reactome pathway
n/an/a>1.00E+3n/an/an/an/an/an/a
Centre de Recherches de Vitry Alfortville Rh£ne-Poulenc Rorer
Curated by ChEMBL
Assay Description
The concentration required to inhibit [3H]spiperone binding to dopamine receptor D2 in rat brain membranes (in vitro)
J Med Chem 34: 2477-83 (1991)
BindingDB Entry DOI: 10.7270/Q2R78FT1
Alpha-1 Adrenergic Receptor/ adrenergic receptor/ adrenergic receptor
(Rattus norvegicus (rat)-Rattus norvegicus (Rat))
BDBM50010042
(2-{3-[4-(4-Chloro-phenyl)-piperazin-1-yl]-propyl}-...)
Show SMILES Clc1ccc(cc1)N1CCN(CCCN2c3cccc4cccc(c34)S2(=O)=O)CC1
Show InChI InChI=1S/C23H24ClN3O2S/c24-19-8-10-20(11-9-19)26-16-14-25(15-17-26)12-3-13-27-21-6-1-4-18-5-2-7-22(23(18)21)30(27,28)29/h1-2,4-11H,3,12-17H2
Reactome pathway
n/an/a>1.00E+3n/an/an/an/an/an/a
Centre de Recherches de Vitry Alfortville Rh£ne-Poulenc Rorer
Curated by ChEMBL
Assay Description
The concentration required to inhibit [3H]prazosin binding to Alpha-1 adrenergic receptor in rat brain membranes was measured (in vitro)
J Med Chem 34: 2477-83 (1991)
BindingDB Entry DOI: 10.7270/Q2R78FT1