BDBM50011551 CHEMBL3262570::US9592235, Example 268::US9855269, Compound 115
SMILES: Nc1ncnc2ccc(cc12)-c1ccccc1
InChI Key: InChIKey=KLSNPRMSQXGJND-UHFFFAOYSA-N
Data: 3 IC50
Activity Spreadsheet -- Enzyme Inhibition Constant Data from BindingDB
Found 3 hits for monomerid = 50011551
Trg + Lig
Ki
nM
ΔG°
kcal/mole
IC50
nM
Kd
nM
EC50/IC50
nM
koff
s-1
kon
M-1s-1
pHTemp
°C
Mitogen-activated protein kinase kinase kinase kinase 4
(Homo sapiens (Human))
BDBM50011551
(CHEMBL3262570 | US9592235, Example 268 | US9855269...)
Show SMILES Nc1ncnc2ccc(cc12)-c1ccccc1
Show InChI InChI=1S/C14H11N3/c15-14-12-8-11(10-4-2-1-3-5-10)6-7-13(12)16-9-17-14/h1-9H,(H2,15,16,17)
NCI pathway
Reactome pathway
n/an/a 121n/an/an/an/an/an/a
Genentech Inc.
Curated by ChEMBL
Assay Description
Inhibition of human MAP4K4 using 5-FAM-LGRDKYKTLRQIRQ-COOH as substrate by Z'-LYTE assay
J Med Chem 57: 3484-93 (2014)
Article DOI: 10.1021/jm500155b
BindingDB Entry DOI: 10.7270/Q2M046ZR
Mitogen-activated protein kinase kinase kinase kinase 4
(Homo sapiens (Human))
BDBM50011551
(CHEMBL3262570 | US9592235, Example 268 | US9855269...)
Show SMILES Nc1ncnc2ccc(cc12)-c1ccccc1
Show InChI InChI=1S/C14H11N3/c15-14-12-8-11(10-4-2-1-3-5-10)6-7-13(12)16-9-17-14/h1-9H,(H2,15,16,17)
NCI pathway
Reactome pathway
US Patent
n/an/a 81.2n/an/an/an/an/an/a
Merck Frosst Centre for Therapeutic Research
Assay Description
The kinase activity of purified human MAP4K4 kinase domain was measured by monitoring the phosphorylation of a peptide substrate derived from moesin ...
J Med Chem 46: 3709-27 (2003)
BindingDB Entry DOI: 10.7270/Q2VH5R4B
Mitogen-activated protein kinase kinase kinase kinase 4
(Homo sapiens (Human))
BDBM50011551
(CHEMBL3262570 | US9592235, Example 268 | US9855269...)
Show SMILES Nc1ncnc2ccc(cc12)-c1ccccc1
Show InChI InChI=1S/C14H11N3/c15-14-12-8-11(10-4-2-1-3-5-10)6-7-13(12)16-9-17-14/h1-9H,(H2,15,16,17)
NCI pathway
Reactome pathway
US Patent
n/an/a 81.2n/an/an/an/an/an/a
Genentech, Inc.
US Patent
Assay Description
The kinase activity of purified human MAP4K4 kinase domain was measured by monitoring the phosphorylation of a peptide substrate derived from moesin ...
US Patent US9592235 (2017)
BindingDB Entry DOI: 10.7270/Q2VX0JKX