BDBM50014089 CHEMBL1236726
SMILES: CN(C)CCCN(C)[C@H]1CCN(C1)C(=O)c1[nH]c2cc(Cl)ccc2c1-c1c(ncn1Cc1ccc(Cl)cc1)-c1ccccc1
InChI Key: InChIKey=LWWQYOWAPGRPRH-NDEPHWFRSA-N
Data: 1 KI  1 EC50
PDB links: 1 PDB ID matches this monomer.
Activity Spreadsheet -- Enzyme Inhibition Constant Data from BindingDB
Found 2 hits for monomerid = 50014089
Trg + Lig
Ki
nM
ΔG°
kcal/mole
IC50
nM
Kd
nM
EC50/IC50
nM
koff
s-1
kon
M-1s-1
pHTemp
°C
E3 ubiquitin-protein ligase Mdm2
(Homo sapiens (Human))
BDBM50014089
(CHEMBL1236726)
Show SMILES CN(C)CCCN(C)[C@H]1CCN(C1)C(=O)c1[nH]c2cc(Cl)ccc2c1-c1c(ncn1Cc1ccc(Cl)cc1)-c1ccccc1 |r,wD:8.7,(-5.37,10.95,;-4.13,10.05,;-2.72,10.67,;-4.29,8.51,;-3.04,7.61,;-3.2,6.08,;-1.96,5.17,;-.55,5.8,;-2.12,3.64,;-3.45,2.87,;-3.13,1.36,;-1.6,1.2,;-.97,2.61,;-.83,-.13,;-1.6,-1.46,;.71,-.13,;1.61,1.12,;3.08,.64,;4.41,1.41,;5.75,.64,;7.08,1.41,;5.75,-.9,;4.41,-1.67,;3.08,-.9,;1.61,-1.38,;1.14,-2.84,;2.04,-4.09,;1.14,-5.33,;-.33,-4.86,;-.33,-3.32,;-1.57,-2.41,;-2.98,-3.04,;-3.14,-4.57,;-4.55,-5.2,;-5.79,-4.29,;-7.2,-4.92,;-5.63,-2.76,;-4.23,-2.13,;3.58,-4.09,;4.35,-2.75,;5.89,-2.75,;6.66,-4.09,;5.89,-5.42,;4.35,-5.42,)|
Show InChI InChI=1S/C35H38Cl2N6O/c1-40(2)17-7-18-41(3)28-16-19-42(22-28)35(44)33-31(29-15-14-27(37)20-30(29)39-33)34-32(25-8-5-4-6-9-25)38-23-43(34)21-24-10-12-26(36)13-11-24/h4-6,8-15,20,23,28,39H,7,16-19,21-22H2,1-3H3/t28-/m0/s1
NCI pathway
Reactome pathway
109n/an/an/an/an/an/an/an/a
University of Utah
Curated by ChEMBL
Assay Description
Displacement of fluorescent P4 peptide from recombinant human MDM2 (18 to 125) expressed in Escherichia coli BL21(DE3) RIL expression system after 30...
Bioorg Med Chem Lett 24: 2546-54 (2014)
Article DOI: 10.1016/j.bmcl.2014.03.095
BindingDB Entry DOI: 10.7270/Q2FX7C05
MDM2-MDMX
(Homo sapiens (Human))
BDBM50014089
(CHEMBL1236726)
Show SMILES CN(C)CCCN(C)[C@H]1CCN(C1)C(=O)c1[nH]c2cc(Cl)ccc2c1-c1c(ncn1Cc1ccc(Cl)cc1)-c1ccccc1 |r,wD:8.7,(-5.37,10.95,;-4.13,10.05,;-2.72,10.67,;-4.29,8.51,;-3.04,7.61,;-3.2,6.08,;-1.96,5.17,;-.55,5.8,;-2.12,3.64,;-3.45,2.87,;-3.13,1.36,;-1.6,1.2,;-.97,2.61,;-.83,-.13,;-1.6,-1.46,;.71,-.13,;1.61,1.12,;3.08,.64,;4.41,1.41,;5.75,.64,;7.08,1.41,;5.75,-.9,;4.41,-1.67,;3.08,-.9,;1.61,-1.38,;1.14,-2.84,;2.04,-4.09,;1.14,-5.33,;-.33,-4.86,;-.33,-3.32,;-1.57,-2.41,;-2.98,-3.04,;-3.14,-4.57,;-4.55,-5.2,;-5.79,-4.29,;-7.2,-4.92,;-5.63,-2.76,;-4.23,-2.13,;3.58,-4.09,;4.35,-2.75,;5.89,-2.75,;6.66,-4.09,;5.89,-5.42,;4.35,-5.42,)|
Show InChI InChI=1S/C35H38Cl2N6O/c1-40(2)17-7-18-41(3)28-16-19-42(22-28)35(44)33-31(29-15-14-27(37)20-30(29)39-33)34-32(25-8-5-4-6-9-25)38-23-43(34)21-24-10-12-26(36)13-11-24/h4-6,8-15,20,23,28,39H,7,16-19,21-22H2,1-3H3/t28-/m0/s1
NCI pathway
n/an/an/an/a 2.00E+4n/an/an/an/a
Sichuan University
Curated by ChEMBL
Assay Description
Inhibition of p53 protein binding to MDMX (unknown origin)
Eur J Med Chem 176: 92-104 (2019)
Article DOI: 10.1016/j.ejmech.2019.05.018
3D
3D Structure (crystal)