null
SMILES: CC(C)Oc1cccc(c1)-c1ccc(COC(=O)N2CCC[C@H]2C(=O)N[C@@H](CC(N)=O)C#N)cc1
InChI Key: InChIKey=IKHAARYUFBFMMB-GMAHTHKFSA-N
Activity Spreadsheet -- Enzyme Inhibition Constant Data from BindingDB
Found 1 hit for monomerid = 50015363
Trg + Lig
Ki
nM
ΔG°
kcal/mole
IC50
nM
Kd
nM
EC50/IC50
nM
koff
s-1
kon
M-1s-1
pHTemp
°C
Legumain
(Homo sapiens (Human))
BDBM50015363
(CHEMBL3264591)
Show SMILES CC(C)Oc1cccc(c1)-c1ccc(COC(=O)N2CCC[C@H]2C(=O)N[C@@H](CC(N)=O)C#N)cc1 |r|
Show InChI InChI=1S/C26H30N4O5/c1-17(2)35-22-6-3-5-20(13-22)19-10-8-18(9-11-19)16-34-26(33)30-12-4-7-23(30)25(32)29-21(15-27)14-24(28)31/h3,5-6,8-11,13,17,21,23H,4,7,12,14,16H2,1-2H3,(H2,28,31)(H,29,32)/t21-,23-/m0/s1
n/an/a 7.80n/an/an/an/an/an/a
Queen's University Belfast
Curated by ChEMBL
Assay Description
Inhibition of recombinant human legumain using Z-Ala-Ala-Asn-AMC fluorogenic substrate
Bioorg Med Chem Lett 24: 2521-4 (2014)
Article DOI: 10.1016/j.bmcl.2014.04.002
BindingDB Entry DOI: 10.7270/Q2QC052W