BDBM50016007 (R)-11-Methoxy-6-methyl-5,6,6a,7-tetrahydro-4H-dibenzo[de,g]quinoline::11-Methoxy-6-methyl-5,6,6a,7-tetrahydro-4H-dibenzo[de,g]quinoline::CHEMBL117841
SMILES: COc1cccc2C[C@H]3N(C)CCc4cccc(c34)-c12
InChI Key: InChIKey=HJSGUUPPOBQDHU-OAHLLOKOSA-N
Data: 3 KI  2 IC50
Activity Spreadsheet -- Enzyme Inhibition Constant Data from BindingDB
Found 5 hits for monomerid = 50016007
Trg + Lig
Ki
nM
ΔG°
kcal/mole
IC50
nM
Kd
nM
EC50/IC50
nM
koff
s-1
kon
M-1s-1
pHTemp
°C
5-hydroxytryptamine receptor 1A
(Rattus norvegicus (rat))
BDBM50016007
((R)-11-Methoxy-6-methyl-5,6,6a,7-tetrahydro-4H-dib...)
Show SMILES COc1cccc2C[C@H]3N(C)CCc4cccc(c34)-c12
Show InChI InChI=1S/C18H19NO/c1-19-10-9-12-5-3-7-14-17(12)15(19)11-13-6-4-8-16(20-2)18(13)14/h3-8,15H,9-11H2,1-2H3/t15-/m1/s1
5.10n/an/an/an/an/an/an/an/a
Uppsala University
Curated by ChEMBL
Assay Description
In vitro displacement of [3H]-8-OH-DPAT binding to rat hippocampal 5-hydroxytryptamine 1A receptor
J Med Chem 39: 3503-13 (1996)
Article DOI: 10.1021/jm960189i
BindingDB Entry DOI: 10.7270/Q2T43S6S
D(2) dopamine receptor
(Homo sapiens (Human))
BDBM50016007
((R)-11-Methoxy-6-methyl-5,6,6a,7-tetrahydro-4H-dib...)
Show SMILES COc1cccc2C[C@H]3N(C)CCc4cccc(c34)-c12
Show InChI InChI=1S/C18H19NO/c1-19-10-9-12-5-3-7-14-17(12)15(19)11-13-6-4-8-16(20-2)18(13)14/h3-8,15H,9-11H2,1-2H3/t15-/m1/s1
Reactome pathway
551n/an/an/an/an/an/an/an/a
Uppsala University
Curated by ChEMBL
Assay Description
Displacement of [3H]-raclopride from human Dopamine receptor D2A
J Med Chem 39: 3503-13 (1996)
Article DOI: 10.1021/jm960189i
BindingDB Entry DOI: 10.7270/Q2T43S6S
D(1A) dopamine receptor
(RAT)
BDBM50016007
((R)-11-Methoxy-6-methyl-5,6,6a,7-tetrahydro-4H-dib...)
Show SMILES COc1cccc2C[C@H]3N(C)CCc4cccc(c34)-c12
Show InChI InChI=1S/C18H19NO/c1-19-10-9-12-5-3-7-14-17(12)15(19)11-13-6-4-8-16(20-2)18(13)14/h3-8,15H,9-11H2,1-2H3/t15-/m1/s1
606n/an/an/an/an/an/an/an/a
Uppsala University
Curated by ChEMBL
Assay Description
In vitro displacement of [3H]-SCH-23,390 binding to rat striatal Dopamine receptor D1
J Med Chem 39: 3503-13 (1996)
Article DOI: 10.1021/jm960189i
BindingDB Entry DOI: 10.7270/Q2T43S6S
D(1A) dopamine receptor
(RAT)
BDBM50016007
((R)-11-Methoxy-6-methyl-5,6,6a,7-tetrahydro-4H-dib...)
Show SMILES COc1cccc2C[C@H]3N(C)CCc4cccc(c34)-c12
Show InChI InChI=1S/C18H19NO/c1-19-10-9-12-5-3-7-14-17(12)15(19)11-13-6-4-8-16(20-2)18(13)14/h3-8,15H,9-11H2,1-2H3/t15-/m1/s1
n/an/a 3.28E+3n/an/an/an/an/an/a
Lilly Research Laboratories
Curated by ChEMBL
Assay Description
In vitro binding affinity towards rat Dopamine receptor D1 by [3H]-SCH-23,390 displacement.
J Med Chem 33: 600-7 (1990)
BindingDB Entry DOI: 10.7270/Q2XS5TCP
D(2) dopamine receptor
(Rattus norvegicus (rat))
BDBM50016007
((R)-11-Methoxy-6-methyl-5,6,6a,7-tetrahydro-4H-dib...)
Show SMILES COc1cccc2C[C@H]3N(C)CCc4cccc(c34)-c12
Show InChI InChI=1S/C18H19NO/c1-19-10-9-12-5-3-7-14-17(12)15(19)11-13-6-4-8-16(20-2)18(13)14/h3-8,15H,9-11H2,1-2H3/t15-/m1/s1
Reactome pathway
n/an/a 2.16E+3n/an/an/an/an/an/a
Lilly Research Laboratories
Curated by ChEMBL
Assay Description
In vitro binding affinity towards rat Dopamine receptor D2 by [3H]-spiperone displacement.
J Med Chem 33: 600-7 (1990)
BindingDB Entry DOI: 10.7270/Q2XS5TCP