BDBM50016973 3-{4-[4-(2-Bromo-thieno[3,2-c]pyridin-4-yl)-piperazin-1-yl]-butyl}-1-thia-3-aza-spiro[4.4]nonane-2,4-dione; hydrochloride::CHEMBL543253
SMILES: Brc1cc2c(nccc2s1)N1CCN(CCCCN2C(=O)SC3(CCCC3)C2=O)CC1
InChI Key: InChIKey=DRRBJWHZVHKSCN-UHFFFAOYSA-N
Data: 3 IC50
Activity Spreadsheet -- Enzyme Inhibition Constant Data from BindingDB
Found 3 hits for monomerid = 50016973
Trg + Lig
Ki
nM
ΔG°
kcal/mole
IC50
nM
Kd
nM
EC50/IC50
nM
koff
s-1
kon
M-1s-1
pHTemp
°C
Serotonin 1 (5-HT1) receptor
(RAT-Rattus norvegicus (rat)-Rattus norvegicus (Rat...)
BDBM50016973
(3-{4-[4-(2-Bromo-thieno[3,2-c]pyridin-4-yl)-pipera...)
Show SMILES Brc1cc2c(nccc2s1)N1CCN(CCCCN2C(=O)SC3(CCCC3)C2=O)CC1
Show InChI InChI=1S/C22H27BrN4O2S2/c23-18-15-16-17(30-18)5-8-24-19(16)26-13-11-25(12-14-26)9-3-4-10-27-20(28)22(31-21(27)29)6-1-2-7-22/h5,8,15H,1-4,6-7,9-14H2
n/an/a 25n/an/an/an/an/an/a
Bristol-Myers Company
Curated by ChEMBL
Assay Description
Ability to bind at 5-hydroxytryptamine 1 receptor of rat hippocampus by displacing [3H]5-HT
J Med Chem 32: 1147-56 (1989)
BindingDB Entry DOI: 10.7270/Q2HD7W8D
D(2) dopamine receptor
(Rattus norvegicus (rat))
BDBM50016973
(3-{4-[4-(2-Bromo-thieno[3,2-c]pyridin-4-yl)-pipera...)
Show SMILES Brc1cc2c(nccc2s1)N1CCN(CCCCN2C(=O)SC3(CCCC3)C2=O)CC1
Show InChI InChI=1S/C22H27BrN4O2S2/c23-18-15-16-17(30-18)5-8-24-19(16)26-13-11-25(12-14-26)9-3-4-10-27-20(28)22(31-21(27)29)6-1-2-7-22/h5,8,15H,1-4,6-7,9-14H2
Reactome pathway
n/an/a 440n/an/an/an/an/an/a
Bristol-Myers Company
Curated by ChEMBL
Assay Description
Ability to bind at dopamine receptor D2 of rat corpus striatum by displacing [3H]spiperone
J Med Chem 32: 1147-56 (1989)
BindingDB Entry DOI: 10.7270/Q2HD7W8D
Serotonin 2 (5-HT2) receptor
(Rattus norvegicus (rat)-RAT-Rattus norvegicus (Rat...)
BDBM50016973
(3-{4-[4-(2-Bromo-thieno[3,2-c]pyridin-4-yl)-pipera...)
Show SMILES Brc1cc2c(nccc2s1)N1CCN(CCCCN2C(=O)SC3(CCCC3)C2=O)CC1
Show InChI InChI=1S/C22H27BrN4O2S2/c23-18-15-16-17(30-18)5-8-24-19(16)26-13-11-25(12-14-26)9-3-4-10-27-20(28)22(31-21(27)29)6-1-2-7-22/h5,8,15H,1-4,6-7,9-14H2
n/an/a 116n/an/an/an/an/an/a
Bristol-Myers Company
Curated by ChEMBL
Assay Description
Ability to bind at 5-hydroxytryptamine 2 receptor of rat hippocampus by displacing [3H]spiperone
J Med Chem 32: 1147-56 (1989)
BindingDB Entry DOI: 10.7270/Q2HD7W8D