BDBM50017349 CHEMBL3288280
SMILES: ON1C(=O)C(C(=O)NCc2ccc(F)cc2)c2ccc(Br)cc2C1=O
InChI Key: InChIKey=JZTZUYBNGPNGBR-UHFFFAOYSA-N
Data: 1 IC50
Activity Spreadsheet -- Enzyme Inhibition Constant Data from BindingDB
Found 1 hit for monomerid = 50017349
Trg + Lig
Ki
nM
ΔG°
kcal/mole
IC50
nM
Kd
nM
EC50/IC50
nM
koff
s-1
kon
M-1s-1
pHTemp
°C
Human immunodeficiency virus type 1 integrase
(Human immunodeficiency virus 1)
BDBM50017349
(CHEMBL3288280)
Show SMILES ON1C(=O)C(C(=O)NCc2ccc(F)cc2)c2ccc(Br)cc2C1=O
Show InChI InChI=1S/C17H12BrFN2O4/c18-10-3-6-12-13(7-10)16(23)21(25)17(24)14(12)15(22)20-8-9-1-4-11(19)5-2-9/h1-7,14,25H,8H2,(H,20,22)
n/an/a 60n/an/an/an/an/an/a
Universit£ Lille Nord de France
Curated by ChEMBL
Assay Description
Inhibition of HIV-1 overall integrase activity using 5'-digoxigenin-labeled GACCCTTTTAGTCAGTGTGGAAAATCTCTAGCAGT-3' as substrate after 1 hr by ELISA
J Med Chem 57: 4640-60 (2014)
Article DOI: 10.1021/jm500109z
BindingDB Entry DOI: 10.7270/Q2TQ6335