BDBM50018004 CHEMBL3289657
SMILES: C/C(/C=C/C=C(/C)\C=C1/CCCc2c(C)cccc12)=C\C(O)=O
InChI Key: InChIKey=PUNLLTFBKSEJRJ-MLZXBFFUSA-N
Data: 2 Kd  2 EC50
PDB links: 1 PDB ID matches this monomer.
Activity Spreadsheet -- Enzyme Inhibition Constant Data from BindingDB
Found 4 hits for monomerid = 50018004
Trg + Lig
Ki
nM
ΔG°
kcal/mole
IC50
nM
Kd
nM
EC50/IC50
nM
koff
s-1
kon
M-1s-1
pHTemp
°C
Retinoic acid receptor RXR-alpha
(Homo sapiens (Human))
BDBM50018004
(CHEMBL3289657)
Show SMILES C/C(/C=C/C=C(/C)\C=C1/CCCc2c(C)cccc12)=C\C(O)=O
Show InChI InChI=1S/C21H24O2/c1-15(7-4-8-16(2)14-21(22)23)13-18-10-6-11-19-17(3)9-5-12-20(18)19/h4-5,7-9,12-14H,6,10-11H2,1-3H3,(H,22,23)/b8-4+,15-7-,16-14+,18-13+
NCI pathway
Reactome pathway
n/an/an/a 2.24E+3n/an/an/an/an/a
University of Alabama at Birmingham
Curated by ChEMBL
Assay Description
Agonist activity at human RXR-alpha-ligand binding domain homodimers assessed as coactivator recruitment by measuring GRIP1 binding to receptor by is...
J Med Chem 57: 5370-80 (2014)
Article DOI: 10.1021/jm5004792
BindingDB Entry DOI: 10.7270/Q2183821
3D
3D Structure (crystal)
Retinoic acid receptor RXR-alpha
(Homo sapiens (Human))
BDBM50018004
(CHEMBL3289657)
Show SMILES C/C(/C=C/C=C(/C)\C=C1/CCCc2c(C)cccc12)=C\C(O)=O
Show InChI InChI=1S/C21H24O2/c1-15(7-4-8-16(2)14-21(22)23)13-18-10-6-11-19-17(3)9-5-12-20(18)19/h4-5,7-9,12-14H,6,10-11H2,1-3H3,(H,22,23)/b8-4+,15-7-,16-14+,18-13+
NCI pathway
Reactome pathway
n/an/an/an/a 720n/an/an/an/a
University of Alabama at Birmingham
Curated by ChEMBL
Assay Description
Agonist activity at Gal4-fused human RXR-alpha expressed in HEK293 cells assessed as receptor-mediated transcriptional activity treated 24 hrs after ...
J Med Chem 57: 5370-80 (2014)
Article DOI: 10.1021/jm5004792
BindingDB Entry DOI: 10.7270/Q2183821
3D
3D Structure (crystal)
NR2B Channel Blocker
(RAT)
BDBM50018004
(CHEMBL3289657)
Show SMILES C/C(/C=C/C=C(/C)\C=C1/CCCc2c(C)cccc12)=C\C(O)=O
Show InChI InChI=1S/C21H24O2/c1-15(7-4-8-16(2)14-21(22)23)13-18-10-6-11-19-17(3)9-5-12-20(18)19/h4-5,7-9,12-14H,6,10-11H2,1-3H3,(H,22,23)/b8-4+,15-7-,16-14+,18-13+
n/an/an/an/a 440n/an/an/an/a
University of Alabama at Birmingham
Curated by ChEMBL
Assay Description
Agonist activity at RXR-alpha in rat R3KE cells infected with oncogene KLF4-ER assessed as inhibition of KLF4-mediated oncogenic transformation
J Med Chem 57: 5370-80 (2014)
Article DOI: 10.1021/jm5004792
BindingDB Entry DOI: 10.7270/Q2183821
3D
3D Structure (crystal)
Retinoic acid receptor RXR-alpha
(Homo sapiens (Human))
BDBM50018004
(CHEMBL3289657)
Show SMILES C/C(/C=C/C=C(/C)\C=C1/CCCc2c(C)cccc12)=C\C(O)=O
Show InChI InChI=1S/C21H24O2/c1-15(7-4-8-16(2)14-21(22)23)13-18-10-6-11-19-17(3)9-5-12-20(18)19/h4-5,7-9,12-14H,6,10-11H2,1-3H3,(H,22,23)/b8-4+,15-7-,16-14+,18-13+
NCI pathway
Reactome pathway
n/an/an/a 18n/an/an/an/an/a
University of Alabama at Birmingham
Curated by ChEMBL
Assay Description
Binding affinity to human RXR-alpha-ligand binding domain homodimers by fluorescence quenching method
J Med Chem 57: 5370-80 (2014)
Article DOI: 10.1021/jm5004792
BindingDB Entry DOI: 10.7270/Q2183821
3D
3D Structure (crystal)