BDBM50018990 CHEMBL3287461
SMILES: Cl.NC(=N)Nc1ccc(cc1)-c1cc(no1)C(=O)Nc1cccc2ccccc12
InChI Key: InChIKey=CCSKPNOYFSUXAB-UHFFFAOYSA-N
Data: 1 IC50
Activity Spreadsheet -- Enzyme Inhibition Constant Data from BindingDB
Found 1 hit for monomerid = 50018990
Trg + Lig
Ki
nM
ΔG°
kcal/mole
IC50
nM
Kd
nM
EC50/IC50
nM
koff
s-1
kon
M-1s-1
pHTemp
°C
Acrosin
(Homo sapiens (Human))
BDBM50018990
(CHEMBL3287461)
Show SMILES Cl.NC(=N)Nc1ccc(cc1)-c1cc(no1)C(=O)Nc1cccc2ccccc12
Show InChI InChI=1S/C21H17N5O2.ClH/c22-21(23)24-15-10-8-14(9-11-15)19-12-18(26-28-19)20(27)25-17-7-3-5-13-4-1-2-6-16(13)17;/h1-12H,(H,25,27)(H4,22,23,24);1H
Reactome pathway
n/an/a 2.99E+4n/an/an/an/an/an/a
Second Military Medical University
Curated by ChEMBL
Assay Description
Inhibition of human acrosin using N-alpha-benzoyl-L-arginine p-nitroanilide as substrate after 3 hrs by spectrophotometry
Bioorg Med Chem Lett 24: 2802-6 (2014)
Article DOI: 10.1016/j.bmcl.2014.04.118
BindingDB Entry DOI: 10.7270/Q2J38V4S