null
SMILES: CN1CCCN(CC1)c1nc2ccccc2n1CCOc1ccccc1
InChI Key: InChIKey=OHSCOSNBRQNOCI-UHFFFAOYSA-N
Activity Spreadsheet -- Enzyme Inhibition Constant Data from BindingDB
Found 1 hit for monomerid = 50019628
Trg + Lig
Ki
nM
ΔG°
kcal/mole
IC50
nM
Kd
nM
EC50/IC50
nM
koff
s-1
kon
M-1s-1
pHTemp
°C
Histamine H1 receptor
(Cavia porcellus (domestic guinea pig))
BDBM50019628
(2-(4-Methyl-[1,4]diazepan-1-yl)-1-(2-phenoxy-ethyl...)
Show SMILES CN1CCCN(CC1)c1nc2ccccc2n1CCOc1ccccc1
Show InChI InChI=1S/C21H26N4O/c1-23-12-7-13-24(15-14-23)21-22-19-10-5-6-11-20(19)25(21)16-17-26-18-8-3-2-4-9-18/h2-6,8-11H,7,12-17H2,1H3
n/an/a 9.10n/an/an/an/an/an/a
TBA
Curated by ChEMBL
Assay Description
In vitro inhibition of histamine-induced contractions in guinea pig ileum
J Med Chem 29: 1178-83 (1987)
BindingDB Entry DOI: 10.7270/Q2QR4XPC